program: Orca
programVersion: 5.0.2
elementType: Cl Cl O O O N C C C C C C C C C C C C C C C C C C C C C C H H H H H H H H H H H H H H H H H H H
charge: 0
multiplicity: 1
keywords: wb97x-d3
keywords: def2-TZVPP
keywords: def2/J RIJCOSX
keywords: DEFGRID2
keywords: scfconv7
keywords: smallprint printgap noloewdin
keywords: NOSOSCF
formula: C22H19Cl2NO3
InChI: InChI=1/C22H19Cl2NO3/c1-22(2)17(12-19(23)24)20(22)21(26)28-18(13-25)14-7-6-10-16(11-14)27-15-8-4-3-5-9-15/h3-12,17-18,20H,1-2H3
47 atoms
Cl 3.305811 -0.493919 -2.133473
Cl 4.872156 -0.446418 0.288475
O  -2.033255 -1.366113 1.147356
O  -1.703517 -1.634166 -1.043373
O  -0.923608 3.388342 -0.26837
N  -4.882867 -2.366971 -0.445533
C  0.667613 -3.462836 -0.109852
C  1.207733 -2.094479 -0.404819
C  0.012105 -2.250516 0.521451
C  -0.005248 -4.21158 -1.233821
C  1.408473 -4.372897 0.840548
C  2.470408 -1.618637 0.172724
C  -1.294166 -1.73735 0.082683
C  3.412667 -0.948107 -0.477149
C  -3.296821 -0.786528 0.909477
C  -3.246967 0.614744 0.324795
C  -4.152238 -1.680734 0.114772
C  -2.055498 1.329324 0.308606
C  -4.425068 1.201913 -0.117362
C  -2.049267 2.632557 -0.174291
C  -4.401646 2.505749 -0.590699
C  -3.221995 3.227235 -0.624152
C  0.237226 3.000886 0.354092
C  0.327476 2.983998 1.739444
C  1.332893 2.693869 -0.436974
C  1.536109 2.650362 2.333125
C  2.540853 2.377918 0.169974
C  2.644816 2.347347 1.553137
H  0.968157 -1.719343 -1.393424
H  0.211782 -2.121552 1.579041
H  -0.805238 -4.848912 -0.852413
H  0.725638 -4.859212 -1.721712
H  -0.425375 -3.562453 -1.998225
H  1.816612 -3.852125 1.70591
H  2.234246 -4.868896 0.327212
H  0.738001 -5.148276 1.214957
H  2.659801 -1.831113 1.218037
H  -3.759108 -0.730713 1.899767
H  -1.135984 0.88826 0.669053
H  -5.361589 0.658494 -0.095797
H  -5.317361 2.966654 -0.93693
H  -3.2037 4.243194 -0.997837
H  -0.532926 3.23385 2.348164
H  1.245895 2.714967 -1.516098
H  1.61133 2.635459 3.412746
H  3.402872 2.158213 -0.445532
H  3.586359 2.094306 2.022364
elementType: Cl O N C H
totalener: -2050.68403239 hartree
nucrepener: 2911.37805892 hartree
electener: -4962.06209132 hartree
oneelecener: -8598.40236215 hartree
twoeener: 3636.34027083 hartree
cpcmener: -0.03333733 hartree
kineticenergy: 2044.46577442 hartree
xcener: -151.869307465068 hartree
chargesum: 0.0000000
charge: -0.055591 -0.059696 -0.289860 -0.426178 -0.322044 -0.087826 0.089067 0.046168 -0.083397 -0.268800 -0.262784 -0.209030 0.375031 0.048056 0.471707 -0.030992 -0.241020 -0.229771 -0.249895 0.333360 -0.097476 -0.257571 0.262435 -0.188204 -0.213827 -0.145345 -0.119344 -0.164545 0.086784 0.096448 0.101163 0.098239 0.096363 0.090163 0.102147 0.099503 0.128649 0.154474 0.134049 0.137864 0.157352 0.144765 0.154543 0.144219 0.159145 0.140741 0.150763
qa: -0.0556 -0.0597 -0.2899 -0.4262 -0.3220 -0.0878 0.0891 0.0462 -0.0834 -0.2688 -0.2628 -0.2090 0.3750 0.0481 0.4717 -0.0310 -0.2410 -0.2298 -0.2499 0.3334 -0.0975 -0.2576 0.2624 -0.1882 -0.2138 -0.1453 -0.1193 -0.1645 0.0868 0.0964 0.1012 0.0982 0.0964 0.0902 0.1021 0.0995 0.1286 0.1545 0.1340 0.1379 0.1574 0.1448 0.1545 0.1442 0.1591 0.1407 0.1508
va: 1.2690 1.2454 2.1330 2.0770 2.0925 3.1031 3.7667 3.8475 3.8641 3.9032 3.9072 3.9007 4.1630 4.2145 3.7829 3.7954 4.0905 3.9410 4.0032 3.7126 3.9045 4.0169 3.7105 3.9457 4.0127 3.9173 3.8258 3.8776 1.0448 1.0365 0.9996 1.0000 1.0191 1.0057 1.0007 1.0014 1.0197 0.9881 1.0240 1.0110 0.9898 1.0088 0.9975 1.0102 0.9897 1.0128 1.0020
dispcorr: -0.027927136 hartree
energy: -2050.711959527649
dipole: -13.10750 14.20534 1.09784 -9.24580 9.29456 0.04877 8.68286 -6.31600 2.36687
magnitude: 2.60954 au
magnitude: 6.63292 debye
