program: Orca
programVersion: 5.0.2
elementType: Cl Cl O O O N C C C C C C C C C C C C C C C C C C C C C C H H H H H H H H H H H H H H H H H H H
charge: 0
multiplicity: 1
keywords: wb97x-d3
keywords: def2-TZVPP
keywords: def2/J RIJCOSX
keywords: DEFGRID2
keywords: scfconv7
keywords: smallprint printgap noloewdin
keywords: NOSOSCF
formula: C22H19Cl2NO3
InChI: InChI=1/C22H19Cl2NO3/c1-22(2)17(12-19(23)24)20(22)21(26)28-18(13-25)14-7-6-10-16(11-14)27-15-8-4-3-5-9-15/h3-12,17-18,20H,1-2H3
47 atoms
Cl 2.327735 -4.867652 1.848726
Cl 3.352441 -6.069078 -0.563661
O  -1.789349 -1.031907 -1.28101
O  -1.221691 -1.429171 0.842139
O  -0.788966 3.839428 -0.631784
N  -4.495876 -0.200639 -2.966585
C  1.629823 -1.153861 -0.577759
C  1.376061 -2.540338 -0.053547
C  0.338217 -1.872529 -0.926392
C  1.629551 -0.017682 0.414497
C  2.597518 -0.94342 -1.716273
C  2.089887 -3.710624 -0.578126
C  -0.939218 -1.447332 -0.326955
C  2.526558 -4.73422 0.144467
C  -3.011149 -0.466595 -0.833575
C  -2.823139 0.884799 -0.179636
C  -3.830819 -0.329285 -2.039322
C  -1.87633 1.76833 -0.679922
C  -3.601564 1.231929 0.91381
C  -1.711922 3.004709 -0.074367
C  -3.43975 2.481127 1.495736
C  -2.499915 3.375209 1.009742
C  -0.021823 4.651696 0.159804
C  0.236577 5.929985 -0.31263
C  0.5314 4.211888 1.355912
C  1.053504 6.776609 0.42242
C  1.336569 5.074029 2.085779
C  1.599589 6.357395 1.627256
H  1.121193 -2.58058 0.999132
H  0.265619 -2.205553 -1.956009
H  0.985013 -0.191881 1.273691
H  1.314388 0.912417 -0.062799
H  2.641238 0.135606 0.794457
H  2.530377 -1.713697 -2.483485
H  3.624879 -0.926513 -1.347619
H  2.404988 0.014538 -2.201956
H  2.275336 -3.755838 -1.644688
H  -3.535649 -1.144349 -0.151467
H  -1.259532 1.51134 -1.53295
H  -4.32804 0.534127 1.310206
H  -4.049989 2.762491 2.343442
H  -2.387311 4.347156 1.473077
H  -0.195443 6.255268 -1.250507
H  0.345078 3.209512 1.7204
H  1.253975 7.77301 0.051183
H  1.765145 4.733043 3.019125
H  2.228752 7.023247 2.20282
elementType: Cl O N C H
totalener: -2050.68626694 hartree
nucrepener: 2732.09154308 hartree
electener: -4782.77781002 hartree
oneelecener: -8239.33144107 hartree
twoeener: 3456.55363105 hartree
cpcmener: -0.03196762 hartree
kineticenergy: 2044.48666047 hartree
xcener: -151.866946412707 hartree
chargesum: 0.0000000
charge: -0.055061 -0.059949 -0.279178 -0.427019 -0.328902 -0.086416 0.098216 0.028594 -0.068869 -0.270733 -0.265758 -0.205049 0.357148 0.041465 0.406018 0.030685 -0.229500 -0.255110 -0.198445 0.251355 -0.126771 -0.174551 0.290740 -0.247402 -0.189617 -0.122127 -0.153472 -0.180665 0.078524 0.101399 0.097033 0.092736 0.105999 0.091727 0.102562 0.099285 0.129748 0.145176 0.137798 0.144275 0.160438 0.158215 0.145735 0.155626 0.157826 0.158826 0.157444
qa: -0.0551 -0.0599 -0.2792 -0.4270 -0.3289 -0.0864 0.0982 0.0286 -0.0689 -0.2707 -0.2658 -0.2050 0.3571 0.0415 0.4060 0.0307 -0.2295 -0.2551 -0.1984 0.2514 -0.1268 -0.1746 0.2907 -0.2474 -0.1896 -0.1221 -0.1535 -0.1807 0.0785 0.1014 0.0970 0.0927 0.1060 0.0917 0.1026 0.0993 0.1297 0.1452 0.1378 0.1443 0.1604 0.1582 0.1457 0.1556 0.1578 0.1588 0.1574
va: 1.2708 1.2451 2.1207 2.0827 2.0668 3.1122 3.7469 3.8869 3.8164 3.9041 3.9033 3.8987 4.2448 4.2131 3.7176 3.6078 4.0786 4.0093 3.9949 3.7809 3.9001 3.9167 3.6722 4.0143 3.8944 3.8874 3.9058 3.9037 1.0500 1.0309 1.0155 1.0005 1.0019 1.0055 1.0009 1.0021 1.0187 1.0148 1.0264 1.0028 0.9902 0.9940 1.0084 0.9972 0.9891 0.9907 0.9906
dispcorr: -0.024774157 hartree
energy: -2050.711041095848
dipole: -1.24225 2.36640 1.12415 39.70140 -38.47649 1.22491 0.44256 0.41665 0.85921
magnitude: 1.87146 au
magnitude: 4.75688 debye
