program: Orca
programVersion: 5.0.2
elementType: Cl Cl O O O N C C C C C C C C C C C C C C C C C C C C C C H H H H H H H H H H H H H H H H H H H
charge: 0
multiplicity: 1
keywords: wb97x-d3
keywords: def2-TZVPP
keywords: def2/J RIJCOSX
keywords: DEFGRID2
keywords: scfconv7
keywords: smallprint printgap noloewdin
keywords: NOSOSCF
formula: C22H19Cl2NO3
InChI: InChI=1/C22H19Cl2NO3/c1-22(2)17(12-19(23)24)20(22)21(26)28-18(13-25)14-7-6-10-16(11-14)27-15-8-4-3-5-9-15/h3-12,17-18,20H,1-2H3
47 atoms
Cl 2.241202 0.133418 -0.717491
Cl 4.310703 -0.831577 1.043951
O  -2.077282 -2.088536 -0.273047
O  -2.22741 -2.283327 1.943472
O  -0.393693 2.622336 -1.091422
N  -4.195319 -1.348397 -2.692448
C  0.292906 -3.976646 -0.227445
C  0.792914 -2.575752 -0.046466
C  -0.295068 -3.12534 0.876746
C  -0.472417 -4.30194 -1.488535
C  1.135621 -5.13908 0.24474
C  2.100133 -2.253768 0.535376
C  -1.617565 -2.479421 0.923533
C  2.784011 -1.138708 0.307207
C  -3.207672 -1.226621 -0.27714
C  -2.807989 0.189522 0.061932
C  -3.748004 -1.30561 -1.635572
C  -1.760208 0.781341 -0.634021
C  -3.455629 0.877882 1.075779
C  -1.375741 2.07443 -0.321518
C  -3.063681 2.176402 1.3740
C  -2.029733 2.783989 0.680984
C  0.602923 3.383877 -0.548779
C  1.105371 3.178664 0.730553
C  1.153649 4.352174 -1.378153
C  2.16067 3.963466 1.174751
C  2.21553 5.119361 -0.923935
C  2.720676 4.934511 0.35606
H  0.436278 -1.875243 -0.792196
H  0.038175 -3.393322 1.872888
H  0.214386 -4.732086 -2.220289
H  -0.937727 -3.437978 -1.95575
H  -1.24879 -5.044016 -1.292623
H  1.608718 -4.966716 1.210927
H  1.921279 -5.360082 -0.479983
H  0.516438 -6.032123 0.344918
H  2.545364 -2.966384 1.219307
H  -3.986351 -1.580661 0.405759
H  -1.245859 0.253036 -1.428592
H  -4.261665 0.410117 1.626267
H  -3.570802 2.724551 2.156815
H  -1.743454 3.80103 0.917426
H  0.694987 2.413614 1.376984
H  0.757086 4.494807 -2.375833
H  2.551607 3.803582 2.171424
H  2.644754 5.868902 -1.576382
H  3.546293 5.537323 0.710522
elementType: Cl O N C H
totalener: -2050.68273569 hartree
nucrepener: 2893.28104441 hartree
electener: -4943.96378010 hartree
oneelecener: -8562.06695679 hartree
twoeener: 3618.10317669 hartree
cpcmener: -0.03197239 hartree
kineticenergy: 2044.47101240 hartree
xcener: -151.865062568987 hartree
chargesum: 0.0000000
charge: -0.057699 -0.060562 -0.277210 -0.434879 -0.320168 -0.084979 0.101365 0.016271 -0.060798 -0.257880 -0.283042 -0.203742 0.377597 0.058894 0.389473 0.019488 -0.233593 -0.234400 -0.186905 0.247819 -0.121289 -0.187662 0.321806 -0.229724 -0.264748 -0.138995 -0.118559 -0.189400 0.086753 0.095743 0.095227 0.091427 0.101272 0.093439 0.103707 0.099953 0.127970 0.139650 0.141697 0.146781 0.160438 0.157936 0.152005 0.145514 0.158891 0.157387 0.157730
qa: -0.0577 -0.0606 -0.2772 -0.4349 -0.3202 -0.0850 0.1014 0.0163 -0.0608 -0.2579 -0.2830 -0.2037 0.3776 0.0589 0.3895 0.0195 -0.2336 -0.2344 -0.1869 0.2478 -0.1213 -0.1877 0.3218 -0.2297 -0.2647 -0.1390 -0.1186 -0.1894 0.0868 0.0957 0.0952 0.0914 0.1013 0.0934 0.1037 0.1000 0.1280 0.1396 0.1417 0.1468 0.1604 0.1579 0.1520 0.1455 0.1589 0.1574 0.1577
va: 1.2753 1.2449 2.1215 2.0761 2.0616 3.1072 3.7453 3.8726 3.8201 3.9001 3.9222 3.9127 4.2162 4.1973 3.7677 3.6334 4.0701 4.0350 3.9750 3.7920 3.8914 3.9363 3.5860 3.8850 4.0198 3.9005 3.8874 3.9117 1.0259 1.0281 1.0002 1.0125 1.0010 1.0054 0.9994 1.0005 1.0214 1.0163 1.0248 1.0032 0.9901 0.9948 1.0045 1.0092 0.9897 0.9892 0.9903
dispcorr: -0.027117917 hartree
energy: -2050.709853605437
dipole: -9.07527 9.89210 0.81683 -8.32800 7.84065 -0.48734 1.49945 -0.17926 1.32020
magnitude: 1.62716 au
magnitude: 4.13590 debye
