program: Orca
programVersion: 5.0.2
elementType: Cl Cl O O O N C C C C C C C C C C C C C C C C C C C C C C H H H H H H H H H H H H H H H H H H H
charge: 0
multiplicity: 1
keywords: wb97x-d3
keywords: def2-TZVPP
keywords: def2/J RIJCOSX
keywords: DEFGRID2
keywords: scfconv7
keywords: smallprint printgap noloewdin
keywords: NOSOSCF
formula: C22H19Cl2NO3
InChI: InChI=1/C22H19Cl2NO3/c1-22(2)17(12-19(23)24)20(22)21(26)28-18(13-25)14-7-6-10-16(11-14)27-15-8-4-3-5-9-15/h3-12,17-18,20H,1-2H3
47 atoms
Cl 2.304736 0.073861 -0.817948
Cl 4.335201 -0.850222 1.009185
O  -2.07541 -2.06988 -0.315334
O  -2.238191 -2.182068 1.906283
O  -0.383474 2.662093 -1.089398
N  -4.127808 -1.327879 -2.792743
C  0.280619 -3.977212 -0.180135
C  0.797477 -2.576844 -0.045936
C  -0.306908 -3.077641 0.884874
C  -0.477021 -4.336585 -1.43671
C  1.099639 -5.133213 0.345862
C  2.102899 -2.251383 0.538329
C  -1.625088 -2.42138 0.897194
C  2.808761 -1.158517 0.27231
C  -3.20591 -1.20761 -0.351591
C  -2.818448 0.210566 -0.007013
C  -3.711447 -1.2899 -1.723281
C  -1.761512 0.80964 -0.68379
C  -3.482867 0.890402 1.001509
C  -1.383374 2.099297 -0.351677
C  -3.097395 2.186399 1.318316
C  -2.051988 2.799006 0.648059
C  0.623423 3.362657 -0.484979
C  1.194727 4.389412 -1.224809
C  1.110264 3.043434 0.776775
C  2.262773 5.099757 -0.697344
C  2.172635 3.770478 1.294743
C  2.75318 4.799796 0.566374
H  0.458267 -1.900242 -0.821236
H  0.013779 -3.311765 1.893613
H  0.206729 -4.816796 -2.139231
H  -0.911109 -3.48112 -1.947479
H  -1.276576 -5.04743 -1.220701
H  0.464475 -6.011136 0.475466
H  1.566054 -4.929954 1.309349
H  1.888495 -5.396284 -0.361111
H  2.527481 -2.941484 1.257674
H  -4.000864 -1.560274 0.31299
H  -1.233758 0.288234 -1.474148
H  -4.295927 0.41627 1.535972
H  -3.616766 2.726449 2.098701
H  -1.765831 3.812596 0.899519
H  0.809182 4.622385 -2.20971
H  0.682232 2.232633 1.352076
H  2.708058 5.89647 -1.279287
H  2.551833 3.5205 2.277339
H  3.583253 5.358873 0.977583
elementType: Cl O N C H
totalener: -2050.68281716 hartree
nucrepener: 2894.61924648 hartree
electener: -4945.30206364 hartree
oneelecener: -8564.76476714 hartree
twoeener: 3619.46270350 hartree
cpcmener: -0.03207444 hartree
kineticenergy: 2044.47004777 hartree
xcener: -151.864495508223 hartree
chargesum: -0.0000000
charge: -0.058036 -0.060604 -0.276633 -0.434810 -0.322163 -0.084780 0.101073 0.013519 -0.058077 -0.257890 -0.282357 -0.201596 0.377164 0.058651 0.390914 0.015516 -0.234143 -0.229438 -0.182002 0.231839 -0.123735 -0.174112 0.311256 -0.258471 -0.218166 -0.121282 -0.145080 -0.186258 0.087213 0.095477 0.095282 0.091116 0.101594 0.100209 0.093192 0.103232 0.127756 0.140014 0.140077 0.146087 0.160311 0.158056 0.146021 0.150107 0.157523 0.158689 0.157746
qa: -0.0580 -0.0606 -0.2766 -0.4348 -0.3222 -0.0848 0.1011 0.0135 -0.0581 -0.2579 -0.2824 -0.2016 0.3772 0.0587 0.3909 0.0155 -0.2341 -0.2294 -0.1820 0.2318 -0.1237 -0.1741 0.3113 -0.2585 -0.2182 -0.1213 -0.1451 -0.1863 0.0872 0.0955 0.0953 0.0911 0.1016 0.1002 0.0932 0.1032 0.1278 0.1400 0.1401 0.1461 0.1603 0.1581 0.1460 0.1501 0.1575 0.1587 0.1577
va: 1.2727 1.2445 2.1241 2.0764 2.0607 3.1071 3.7441 3.8766 3.8189 3.9006 3.9225 3.9111 4.2144 4.1940 3.7675 3.6264 4.0702 4.0345 3.9690 3.8054 3.8933 3.9311 3.6004 4.0161 3.8763 3.8901 3.9026 3.9086 1.0263 1.0282 1.0001 1.0125 1.0009 1.0004 1.0056 0.9995 1.0215 1.0153 1.0249 1.0037 0.9902 0.9945 1.0087 1.0044 0.9891 0.9901 0.9903
dispcorr: -0.027179725 hartree
energy: -2050.709996884056
dipole: -9.47545 10.22025 0.74480 -8.50518 7.93681 -0.56837 2.67552 -1.27012 1.40540
magnitude: 1.68906 au
magnitude: 4.29324 debye
