program: Orca
programVersion: 5.0.2
elementType: Cl Cl O O O N C C C C C C C C C C C C C C C C C C C C C C H H H H H H H H H H H H H H H H H H H
charge: 0
multiplicity: 1
keywords: wb97x-d3
keywords: def2-TZVPP
keywords: def2/J RIJCOSX
keywords: DEFGRID2
keywords: scfconv7
keywords: smallprint printgap noloewdin
keywords: NOSOSCF
formula: C22H19Cl2NO3
InChI: InChI=1/C22H19Cl2NO3/c1-22(2)17(12-19(23)24)20(22)21(26)28-18(13-25)14-7-6-10-16(11-14)27-15-8-4-3-5-9-15/h3-12,17-18,20H,1-2H3
47 atoms
Cl 3.694978 -1.060367 -1.943929
Cl 4.991262 -0.688583 0.607081
O  -2.212261 -1.317478 1.150341
O  -1.640743 -1.1452 -1.000692
O  -1.312846 3.60396 0.704487
N  -4.807525 -2.31918 -0.797943
C  0.567078 -3.195395 -0.059292
C  1.174265 -1.83592 -0.256624
C  -0.060851 -1.979905 0.602259
C  -0.098817 -3.85343 -1.241441
C  1.238524 -4.177671 0.868673
C  2.436003 -1.461394 0.401914
C  -1.342984 -1.438497 0.126946
C  3.55015 -1.119053 -0.230444
C  -3.491498 -0.787215 0.865569
C  -3.470644 0.667928 0.435886
C  -4.202547 -1.641303 -0.095692
C  -2.389559 1.463174 0.785029
C  -4.550586 1.219585 -0.243866
C  -2.367807 2.795185 0.395059
C  -4.532658 2.563486 -0.58494
C  -3.437038 3.357638 -0.284293
C  -0.033921 3.148439 0.522368
C  0.925782 3.603738 1.415482
C  0.317897 2.313343 -0.532753
C  2.250544 3.226937 1.245323
C  1.645627 1.941919 -0.685327
C  2.616907 2.392015 0.199002
H  1.006411 -1.403623 -1.237406
H  0.084537 -1.917232 1.675075
H  -0.936225 -4.475712 -0.919598
H  0.618835 -4.503241 -1.745497
H  -0.467656 -3.145112 -1.979846
H  1.641334 -3.711561 1.767295
H  2.060514 -4.682525 0.35745
H  0.528272 -4.942635 1.187227
H  2.468509 -1.470176 1.485121
H  -4.037359 -0.871569 1.809801
H  -1.55566 1.061186 1.347404
H  -5.406859 0.614348 -0.514534
H  -5.374451 2.992248 -1.112787
H  -3.409108 4.399964 -0.575485
H  0.636839 4.25336 2.232363
H  -0.42346 1.958227 -1.237549
H  2.997448 3.58562 1.942033
H  1.918545 1.300348 -1.513091
H  3.650161 2.097981 0.070504
elementType: Cl O N C H
totalener: -2050.68410948 hartree
nucrepener: 2911.98247267 hartree
electener: -4962.66658215 hartree
oneelecener: -8599.51906892 hartree
twoeener: 3636.85248677 hartree
cpcmener: -0.03197972 hartree
kineticenergy: 2044.47259484 hartree
xcener: -151.870201120489 hartree
chargesum: -0.0000000
charge: -0.055810 -0.057781 -0.289753 -0.426073 -0.329410 -0.084598 0.107613 -0.016671 -0.068157 -0.270760 -0.255712 -0.168373 0.370029 0.015828 0.497268 -0.012969 -0.251484 -0.232511 -0.212660 0.267530 -0.114259 -0.232022 0.298777 -0.254740 -0.201705 -0.115689 -0.153737 -0.173660 0.095547 0.098611 0.102755 0.098722 0.095312 0.089247 0.101640 0.099808 0.137992 0.151331 0.148312 0.136647 0.158788 0.147707 0.145178 0.151193 0.156532 0.157484 0.148683
qa: -0.0558 -0.0578 -0.2898 -0.4261 -0.3294 -0.0846 0.1076 -0.0167 -0.0682 -0.2708 -0.2557 -0.1684 0.3700 0.0158 0.4973 -0.0130 -0.2515 -0.2325 -0.2127 0.2675 -0.1143 -0.2320 0.2988 -0.2547 -0.2017 -0.1157 -0.1537 -0.1737 0.0955 0.0986 0.1028 0.0987 0.0953 0.0892 0.1016 0.0998 0.1380 0.1513 0.1483 0.1366 0.1588 0.1477 0.1452 0.1512 0.1565 0.1575 0.1487
va: 1.2672 1.2475 2.1342 2.0714 2.0851 3.1024 3.7884 3.8528 3.8560 3.9058 3.9021 3.8056 4.1796 4.1940 3.7747 3.7264 4.0923 3.9565 3.9741 3.7446 3.9087 4.0297 3.6773 4.0190 3.9057 3.9179 3.8502 3.8654 1.0314 1.0359 1.0000 1.0008 1.0179 1.0043 1.0014 1.0024 1.0123 0.9869 1.0128 1.0128 0.9897 1.0046 1.0081 1.0061 0.9891 1.0000 1.0064
dispcorr: -0.029060049 hartree
energy: -2050.713169526873
dipole: -15.32088 15.82756 0.50668 -6.01043 5.93018 -0.08025 4.58087 -2.59129 1.98957
magnitude: 2.05465 au
magnitude: 5.22249 debye
