program: Orca
programVersion: 5.0.2
elementType: Cl Cl O O O N C C C C C C C C C C C C C C C C C C C C C C H H H H H H H H H H H H H H H H H H H
charge: 0
multiplicity: 1
keywords: wb97x-d3
keywords: def2-TZVPP
keywords: def2/J RIJCOSX
keywords: DEFGRID2
keywords: scfconv7
keywords: smallprint printgap noloewdin
keywords: NOSOSCF
formula: C22H19Cl2NO3
InChI: InChI=1/C22H19Cl2NO3/c1-22(2)17(12-19(23)24)20(22)21(26)28-18(13-25)14-7-6-10-16(11-14)27-15-8-4-3-5-9-15/h3-12,17-18,20H,1-2H3
47 atoms
Cl 4.355515 -2.834807 0.598519
Cl 3.826548 -5.655225 0.302064
O  -1.881982 -1.272672 0.415918
O  0.033421 -0.125379 0.525387
O  -1.85959 4.494113 -0.336271
N  -4.87449 -1.099934 1.79992
C  0.709449 -2.098277 -1.85393
C  1.477693 -2.451636 -0.612796
C  -0.023458 -2.272739 -0.536055
C  0.918709 -0.723478 -2.439649
C  0.441198 -3.1525 -2.900142
C  2.040818 -3.7909 -0.404596
C  -0.569455 -1.109745 0.183864
C  3.241712 -4.047758 0.097663
C  -2.561887 -0.173595 1.014093
C  -2.747604 0.963366 0.037511
C  -3.853736 -0.710794 1.446074
C  -2.221644 2.208394 0.344054
C  -3.404045 0.744917 -1.168341
C  -2.336017 3.240755 -0.578828
C  -3.529794 1.790673 -2.068395
C  -2.991558 3.036934 -1.784568
C  -0.700151 4.676139 0.369445
C  -0.662122 5.752356 1.244288
C  0.417182 3.869603 0.186746
C  0.505898 6.024524 1.941773
C  1.573763 4.146968 0.901152
C  1.62587 5.221431 1.779022
H  2.050739 -1.632382 -0.19415
H  -0.622668 -3.17347 -0.46252
H  1.227594 0.017118 -1.704965
H  0.007885 -0.363871 -2.922675
H  1.698777 -0.768697 -3.201741
H  -0.3912 -2.846667 -3.536307
H  0.18475 -4.1227 -2.476371
H  1.315102 -3.286503 -3.540436
H  1.434623 -4.645837 -0.679477
H  -2.036945 0.173752 1.909684
H  -1.719464 2.361582 1.291356
H  -3.815509 -0.22803 -1.407799
H  -4.042574 1.634694 -3.008244
H  -3.07956 3.849936 -2.494252
H  -1.539523 6.373904 1.372912
H  0.395515 3.032264 -0.499934
H  0.534078 6.866711 2.62114
H  2.442264 3.516019 0.762887
H  2.533057 5.431938 2.329846
elementType: Cl O N C H
totalener: -2050.68648602 hartree
nucrepener: 2742.98815248 hartree
electener: -4793.67463850 hartree
oneelecener: -8261.21148660 hartree
twoeener: 3467.53684810 hartree
cpcmener: -0.03089055 hartree
kineticenergy: 2044.47822486 hartree
xcener: -151.864831986729 hartree
chargesum: 0.0000000
charge: -0.055389 -0.059628 -0.274292 -0.439752 -0.327139 -0.086860 0.088949 0.031830 -0.073845 -0.261867 -0.265345 -0.208169 0.379243 0.043085 0.403061 0.021801 -0.226066 -0.193510 -0.235057 0.282375 -0.121113 -0.225673 0.289885 -0.248167 -0.194570 -0.120799 -0.145790 -0.183774 0.080524 0.099612 0.091118 0.098537 0.100838 0.098982 0.091169 0.102132 0.130986 0.137975 0.144754 0.147161 0.159074 0.148165 0.145224 0.156703 0.157518 0.158373 0.157730
qa: -0.0554 -0.0596 -0.2743 -0.4398 -0.3271 -0.0869 0.0889 0.0318 -0.0738 -0.2619 -0.2653 -0.2082 0.3792 0.0431 0.4031 0.0218 -0.2261 -0.1935 -0.2351 0.2824 -0.1211 -0.2257 0.2899 -0.2482 -0.1946 -0.1208 -0.1458 -0.1838 0.0805 0.0996 0.0911 0.0985 0.1008 0.0990 0.0912 0.1021 0.1310 0.1380 0.1448 0.1472 0.1591 0.1482 0.1452 0.1567 0.1575 0.1584 0.1577
va: 1.2703 1.2453 2.1372 2.0724 2.0871 3.1123 3.7409 3.8671 3.8387 3.9087 3.9051 3.9011 4.2148 4.2124 3.7401 3.5762 4.0714 3.9325 3.9802 3.7366 3.9068 4.0146 3.6897 4.0086 3.9083 3.8830 3.8989 3.9084 1.0483 1.0316 1.0152 1.0001 1.0016 1.0014 1.0056 1.0006 1.0179 1.0170 1.0084 1.0103 0.9894 1.0052 1.0085 0.9947 0.9892 0.9908 0.9905
dispcorr: -0.024388384 hartree
energy: -2050.710874402484
dipole: -14.53405 15.16999 0.63594 22.89368 -22.76506 0.12863 -15.80274 14.30174 -1.50100
magnitude: 1.63522 au
magnitude: 4.15641 debye
