program: Orca
programVersion: 5.0.2
elementType: Cl Cl O O O N C C C C C C C C C C C C C C C C C C C C C C H H H H H H H H H H H H H H H H H H H
charge: 0
multiplicity: 1
keywords: wb97x-d3
keywords: def2-TZVPP
keywords: def2/J RIJCOSX
keywords: DEFGRID2
keywords: scfconv7
keywords: smallprint printgap noloewdin
keywords: NOSOSCF
formula: C22H19Cl2NO3
InChI: InChI=1/C22H19Cl2NO3/c1-22(2)17(12-19(23)24)20(22)21(26)28-18(13-25)14-7-6-10-16(11-14)27-15-8-4-3-5-9-15/h3-12,17-18,20H,1-2H3
47 atoms
Cl 1.512593 -5.682994 0.333797
Cl 3.786923 -5.332231 -1.404762
O  -1.060723 -0.129816 -1.389802
O  -1.558994 -1.620414 0.197428
O  -1.72675 4.206501 1.384635
N  -2.74719 1.546756 -3.686826
C  1.501946 -1.223942 0.849525
C  1.266521 -2.54356 0.17341
C  0.722247 -1.274224 -0.452024
C  0.793435 -0.963433 2.156237
C  2.862774 -0.575128 0.77829
C  2.333117 -3.262177 -0.533689
C  -0.735145 -1.064404 -0.481519
C  2.509479 -4.577444 -0.530763
C  -2.431377 0.248146 -1.44289
C  -2.81631 1.129644 -0.278717
C  -2.58644 0.969692 -2.707058
C  -2.063603 2.26929 -0.017754
C  -3.894871 0.789239 0.521317
C  -2.392197 3.060736 1.072607
C  -4.226385 1.605451 1.594475
C  -3.475957 2.732495 1.880806
C  -0.413769 4.374638 1.027683
C  -0.064986 5.577294 0.432435
C  0.550043 3.413523 1.307159
C  1.264817 5.822532 0.118606
C  1.872872 3.666763 0.975697
C  2.237001 4.868662 0.382749
H  0.519061 -3.165382 0.652785
H  1.252641 -0.890853 -1.316469
H  0.532541 0.092711 2.252851
H  1.457524 -1.213455 2.985586
H  -0.114544 -1.548834 2.281728
H  3.329999 -0.659925 -0.202193
H  3.537044 -1.022205 1.51139
H  2.78465 0.489514 1.007614
H  3.033761 -2.680292 -1.120729
H  -3.083663 -0.629949 -1.485675
H  -1.234427 2.534041 -0.663411
H  -4.470064 -0.103567 0.311859
H  -5.067361 1.351607 2.226056
H  -3.726678 3.362356 2.725091
H  -0.826627 6.318065 0.223857
H  0.279631 2.477372 1.780794
H  1.536454 6.763861 -0.341368
H  2.624275 2.917435 1.189797
H  3.271949 5.060154 0.13151
elementType: Cl O N C H
totalener: -2050.68631046 hartree
nucrepener: 2773.38328262 hartree
electener: -4824.06959308 hartree
oneelecener: -8321.64210146 hartree
twoeener: 3497.57250838 hartree
cpcmener: -0.03254099 hartree
kineticenergy: 2044.47531460 hartree
xcener: -151.864732637942 hartree
chargesum: 0.0000000
charge: -0.054861 -0.059124 -0.281462 -0.437255 -0.323546 -0.086506 0.081496 0.028955 -0.058176 -0.258945 -0.263334 -0.207495 0.368701 0.041707 0.415978 0.022074 -0.233067 -0.216327 -0.207638 0.270001 -0.105073 -0.243005 0.261408 -0.224042 -0.203555 -0.130752 -0.167377 -0.169943 0.081302 0.099236 0.091510 0.101416 0.099124 0.092646 0.103948 0.087632 0.129507 0.140377 0.145744 0.145351 0.158462 0.147620 0.145838 0.183573 0.157882 0.172750 0.157245
qa: -0.0549 -0.0591 -0.2815 -0.4373 -0.3235 -0.0865 0.0815 0.0290 -0.0582 -0.2589 -0.2633 -0.2075 0.3687 0.0417 0.4160 0.0221 -0.2331 -0.2163 -0.2076 0.2700 -0.1051 -0.2430 0.2614 -0.2240 -0.2036 -0.1308 -0.1674 -0.1699 0.0813 0.0992 0.0915 0.1014 0.0991 0.0926 0.1039 0.0876 0.1295 0.1404 0.1457 0.1454 0.1585 0.1476 0.1458 0.1836 0.1579 0.1727 0.1572
va: 1.2707 1.2458 2.1325 2.0763 2.0918 3.1132 3.7344 3.8848 3.8353 3.8978 3.9139 3.9035 4.2214 4.2142 3.7349 3.6029 4.0844 3.9406 3.9722 3.7561 3.8984 4.0091 3.7418 3.9992 3.9288 3.8913 3.9026 3.9164 1.0484 1.0317 1.0027 1.0013 1.0177 1.0060 1.0013 1.0068 1.0188 1.0164 1.0162 1.0048 0.9891 1.0059 1.0075 0.9715 0.9892 0.9828 0.9917
dispcorr: -0.025440530 hartree
energy: -2050.711750991826
dipole: -1.87648 2.95090 1.07442 33.41347 -32.90072 0.51275 14.34137 -12.96533 1.37604
magnitude: 1.81955 au
magnitude: 4.62493 debye
