program: Gaussian 09
title: 000074444
version: EM64L-G09RevD.01
frameworkgroup: C1[X(C7H12N2)]
method: RPBEPBE
basis: SDD
operation: Freq
keyword: #pfreq=noraman
keyword: PBEPBE/SDD
title: #p freq=noraman PBEPBE/SDD
converged: YES YES NO NO
title: Mulliken charges:
elementType: N N C C C C C C C H H H H H H H H H H H H
charge: -0.193039 -0.133052 0.256566 0.191415 0.065235 -0.637562 -0.789643 -0.794106 -0.796467 0.248501 0.234824 0.237060 0.226818 0.248557 0.225119 0.223715 0.225062 0.269836 0.220559 0.253212 0.217388
chargesum: 0.00000
title: Mulliken charges with hydrogens summed into heavy atoms:
elementType: N N C C C C C C C
charge: -0.193039 -0.133052 0.256566 0.191415 0.065235 0.082823 -0.089148 -0.075492 -0.105308
polarizability: 1.06398298e+02 -7.95334491e-01 9.71399311e+01 2.88267337e-01 1.78800264e-01 5.67310149e+01
1716.lowfreq: -68.4100 -15.7521 -9.1364 -6.1234 0.0008 0.0009 0.0010 46.1337 123.6376
frequency: -68.3052 46.0641 123.6247 135.4019 150.9238 175.8291 241.3248 261.0680 267.6790 280.0414 325.8253 515.8795 569.5311 595.2524 640.3385 673.6664 704.2796 813.4919 942.5811 973.7149 1002.1746 1035.1033 1042.2206 1050.0017 1104.7551 1116.4722 1157.6302 1222.5232 1287.7550 1380.0603 1384.3743 1392.8088 1396.8891 1413.7962 1445.8585 1462.4232 1463.3764 1469.2099 1472.6470 1476.1080 1480.3014 1482.3944 1487.1370 1507.7016 1595.6882 2957.2470 2969.2617 2972.2388 2981.6732 3022.1847 3039.3163 3044.1133 3060.3284 3090.5558 3098.1462 3109.7163 3113.7348
redmass: 1.0190 1.0684 1.5109 1.3322 1.1685 2.2642 2.4686 4.0021 2.5480 2.5166 3.6771 2.6986 4.3634 4.0800 4.5713 5.7360 4.2995 2.8097 2.1276 1.5673 1.7055 1.3814 1.4441 1.5083 2.0669 1.3289 2.3718 5.0827 5.0025 2.9933 1.7840 1.3141 1.5075 1.7220 1.2327 1.0556 1.1364 1.0497 1.1175 1.0586 1.2841 1.1204 1.2067 2.4027 7.0433 1.0396 1.0395 1.0384 1.0363 1.0980 1.0981 1.0981 1.1008 1.0946 1.0965 1.0978 1.0955
irintensity: 0.0046 0.0324 0.0974 0.2145 1.3268 11.6516 0.5351 0.0867 3.1538 1.7638 0.1834 3.0971 0.2662 0.7330 0.0472 0.3155 7.4059 5.8104 1.3549 2.7733 5.2612 3.2409 3.3973 0.2979 0.1673 0.9605 10.4440 2.3103 10.1537 37.9775 39.4040 21.9258 17.8185 5.2952 33.0154 1.9385 11.1663 54.4899 10.4752 1.2823 1.1378 2.8478 0.7060 23.2048 9.3222 53.7883 53.4473 40.3002 56.9791 27.4181 27.1815 30.8428 27.5247 17.4292 11.2375 13.4690 6.4668
temp: 298.150 k
press: 1.00000 atm
elementType: 7 7 6 6 6 6 6 6 6 1 1 1 1 1 1 1 1 1 1 1 1
symmnumber: 1
zpe: 467886.1 jmol-1
zpe.correction: 0.178208 hartree
zpe.thermalcorrener: 0.188161 hartree
zpe.thermalcorrenthalpy: 0.189105 hartree
zpe.thermalcorrgfe: 0.143030 hartree
zpe.sumelectzpe: -382.752816 hartree
zpe.sumelectthermal: -382.742864 hartree
zpe.sumelectthermalent: -382.741920 hartree
zpe.sumelectthermalfe: -382.787995 hartree
dipole: 1.3792 3.9162 -0.0025
dipole: 4.1520
quadrupole: -47.1601 -56.2159 -56.5009
quadrupole: 0.4806 0.0043 -0.0049
quadrupole: 6.1322 -2.9236 -3.2086 0.4806 0.0043 -0.0049
hfenergy: -382.9310248 hartree
pointgroup: C01 [X(C7H12N2)]
dipole: -0.5487337 1.5385605 -0.0080264 debye
dipolederiv: -0.44021 0.3345828 -0.0039085 0.2411644 -0.5850466 0.007628 0.0190589 -0.0246095 -0.1117722 -0.5230963 0.1170968 -0.000654 0.0857596 -0.5023026 -0.0001069 0.0054844 0.0015518 -0.2722145 0.1436662 -0.2205827 -0.0000485 0.0620866 0.0911136 -0.003134 -0.0024418 0.0205181 -0.0828868 0.2771967 0.0370135 -0.0061466 -0.1309164 0.5417438 -0.0046773 -0.0129342 -0.0075939 -0.0247259 0.3451508 -0.1079411 -0.0033222 -0.1020741 -0.0019202 0.0056777 0.0042443 -0.0070275 -0.0929368 0.2273461 -0.1886383 0.0168347 -0.1679532 0.3737345 -0.0176358 0.0104144 -0.0038812 0.235173 0.0014746 0.0184374 0.004865 -0.0630365 0.0405534 0.0031636 0.0026927 -0.0064489 0.1406551 -0.0458893 -0.056582 0.0042382 -0.002926 -0.0128356 0.0018153 0.0052814 0.0045291 0.119069 -0.0634951 0.0320975 0.0048276 0.0214095 0.0416996 -0.0061132 -0.0060314 -0.0001586 0.1164196 -0.0939245 -0.0024223 0.025585 -0.087883 0.0825959 0.0205047 0.0268835 0.0102752 0.1071912 0.0751113 -0.0289112 -0.0742732 0.0487634 -0.0742184 -0.0852187 -0.0258253 -0.127474 -0.0280403 0.0716792 0.0240597 0.0384649 0.0772741 -0.0491695 0.0760507 -0.0216112 0.1389346 -0.0858146 0.0813904 0.0061828 0.0607145 -0.0426991 -0.0767798 -0.0905272 0.0141564 -0.1522619 -0.0660147 -0.1139845 -0.0007008 0.0100473 0.0752861 0.0993204 -0.0041899 0.0106013 0.0005592 0.1109725 0.0759379 0.0219874 -0.0733628 -0.0327464 -0.0763631 0.0934245 -0.0262786 0.150857 -0.055768 -0.06578 -0.0165332 0.0750347 0.0428066 0.0762763 -0.090299 0.1326583 -0.0505974 -0.0626544 -0.073447 -0.0170523 -0.0737467 0.0424785 0.078961 0.0854765 -0.133616 0.0476594 -0.0573669 0.1212346 0.0456451 -0.0005644 -0.0444755 -0.0815066 0.0026327 0.0002919 -0.000024 0.1262118 -0.0580994 0.0311647 -0.085818 -0.0265683 0.0793532 -0.0727781 -0.1423409 -0.0291381 -0.0736307 0.1106843 -0.0444847 -0.0026072 0.052989 -0.1102577 -0.0133228 0.0027123 -0.0116906 0.115651 -0.052946 0.0155808 0.0838404 -0.0487393 0.0650482 0.0916293 0.1365996 0.046021 -0.0575174 unknown
polarizability: 106.3869759|0.8227547|97.1361228|-0.574499|-0.6758041|56.7461457 unknown
InChI: InChI=1S/C7H12N2/c1-5-6(2)9(4)7(3)8-5/h1-4H3
charge 0 multiplicity 1
21 atoms
N  -0.709396 0.651915 0.013081
N  0.014867 -1.490483 0.01871
C  0.702786 0.707636 -0.016568
C  -1.079544 -0.697787 0.03248
C  1.128788 -0.626641 -0.011565
C  -1.603482 1.811969 0.000807
C  1.47003 1.996758 -0.040314
C  -2.497708 -1.184103 0.064095
C  2.533232 -1.169899 -0.029064
H  -2.641156 1.477523 0.154979
H  -1.342939 2.518505 0.809197
H  -1.550845 2.350523 -0.963719
H  1.298822 2.610807 0.866524
H  2.549737 1.779374 -0.090479
H  1.217602 2.626561 -0.916524
H  -3.043732 -0.847168 0.966592
H  -3.079241 -0.860345 -0.82067
H  -2.473211 -2.284753 0.072351
H  3.099259 -0.901328 0.883472
H  2.486215 -2.269709 -0.086448
H  3.113417 -0.805754 -0.898138
