program: Orca
programVersion: 5.0.2
elementType: Cl Cl O O O N C C C C C C C C C C C C C C C C C C C C C C H H H H H H H H H H H H H H H H H H H
charge: 0
multiplicity: 1
keywords: wb97x-d3
keywords: def2-TZVPP
keywords: def2/J RIJCOSX
keywords: DEFGRID2
keywords: scfconv7
keywords: smallprint printgap noloewdin
keywords: NOSOSCF
formula: C22H19Cl2NO3
InChI: InChI=1/C22H19Cl2NO3/c1-22(2)17(12-19(23)24)20(22)21(26)28-18(13-25)14-7-6-10-16(11-14)27-15-8-4-3-5-9-15/h3-12,17-18,20H,1-2H3
47 atoms
Cl -0.057959 -3.933742 -3.067768
Cl 1.9016 -5.912796 -3.833997
O  0.063434 -0.910157 0.074288
O  -1.334534 -2.578423 0.564529
O  -0.746296 4.33411 2.402716
N  -2.727105 -0.138397 -1.678818
C  1.475872 -4.041226 1.024197
C  0.747929 -4.543305 -0.174265
C  0.943322 -3.055466 -0.009289
C  0.817227 -4.164729 2.374619
C  2.978999 -4.158976 1.070946
C  1.431346 -5.253406 -1.27684
C  -0.232159 -2.209809 0.247668
C  1.134948 -5.058696 -2.553609
C  -0.987851 0.020816 0.272115
C  -0.401735 1.409549 0.311847
C  -1.96063 -0.088546 -0.824105
C  -0.828156 2.275696 1.305711
C  0.521878 1.828763 -0.63938
C  -0.320469 3.567245 1.361495
C  1.026011 3.117307 -0.5653
C  0.616727 3.993925 0.430266
C  -0.852512 5.693772 2.283516
C  -0.431664 6.453842 3.365127
C  -1.421413 6.297086 1.168496
C  -0.582636 7.832691 3.329772
C  -1.552787 7.678034 1.141563
C  -1.136142 8.451214 2.217296
H  -0.267734 -4.884652 0.012625
H  1.707032 -2.589428 -0.622068
H  -0.269916 -4.147253 2.324435
H  1.139053 -3.362737 3.041445
H  1.105244 -5.11102 2.836216
H  3.440672 -4.037379 0.090168
H  3.275532 -5.134606 1.460957
H  3.401382 -3.397921 1.729387
H  2.18746 -5.991748 -1.034919
H  -1.523375 -0.181505 1.20466
H  -1.550512 1.951909 2.045794
H  0.850731 1.165297 -1.428859
H  1.755432 3.449862 -1.292039
H  1.034721 4.99142 0.473869
H  0.00241 5.967324 4.229956
H  -1.765945 5.704518 0.329936
H  -0.258386 8.423894 4.176559
H  -1.993379 8.149779 0.272495
H  -1.246456 9.527221 2.189834
elementType: Cl O N C H
totalener: -2050.68523421 hartree
nucrepener: 2653.98475075 hartree
electener: -4704.66998496 hartree
oneelecener: -8083.75837239 hartree
twoeener: 3379.08838743 hartree
cpcmener: -0.03219701 hartree
kineticenergy: 2044.48070736 hartree
xcener: -151.864042327882 hartree
chargesum: 0.0000000
charge: -0.049181 -0.055225 -0.279446 -0.439999 -0.324254 -0.090483 0.130495 -0.034915 -0.133452 -0.267295 -0.280143 -0.215483 0.398051 0.072853 0.414930 0.013799 -0.232109 -0.214578 -0.210929 0.257354 -0.148705 -0.175797 0.287510 -0.248626 -0.198422 -0.121236 -0.141660 -0.183635 0.112658 0.115582 0.094412 0.100988 0.098456 0.094404 0.102157 0.100391 0.140597 0.129295 0.134914 0.148187 0.159522 0.158590 0.145512 0.159268 0.158348 0.159015 0.158286
qa: -0.0492 -0.0552 -0.2794 -0.4400 -0.3243 -0.0905 0.1305 -0.0349 -0.1335 -0.2673 -0.2801 -0.2155 0.3981 0.0729 0.4149 0.0138 -0.2321 -0.2146 -0.2109 0.2574 -0.1487 -0.1758 0.2875 -0.2486 -0.1984 -0.1212 -0.1417 -0.1836 0.1127 0.1156 0.0944 0.1010 0.0985 0.0944 0.1022 0.1004 0.1406 0.1293 0.1349 0.1482 0.1595 0.1586 0.1455 0.1593 0.1583 0.1590 0.1583
va: 1.2832 1.2511 2.1553 2.0663 2.0811 3.1126 3.7296 3.8714 3.8388 3.8934 3.9142 3.9028 4.1629 4.1890 3.7119 3.7459 4.0167 4.0548 3.9822 3.7909 3.9268 3.9118 3.6818 4.0107 3.9195 3.8840 3.8898 3.9050 1.0247 1.0189 1.0151 0.9995 1.0014 0.9988 0.9996 1.0029 1.0079 1.0254 1.0182 1.0127 0.9914 0.9949 1.0082 0.9958 0.9890 0.9904 0.9904
dispcorr: -0.023122512 hartree
energy: -2050.708356720529
dipole: 7.17190 -4.64360 2.52830 23.58615 -22.78906 0.79709 30.22561 -28.45887 1.76675
magnitude: 3.18576 au
magnitude: 8.09756 debye
