program: Orca
programVersion: 5.0.2
elementType: Cl Cl O O O N C C C C C C C C C C C C C C C C C C C C C C H H H H H H H H H H H H H H H H H H H
charge: 0
multiplicity: 1
keywords: wb97x-d3
keywords: def2-TZVPP
keywords: def2/J RIJCOSX
keywords: DEFGRID2
keywords: scfconv7
keywords: smallprint printgap noloewdin
keywords: NOSOSCF
formula: C22H19Cl2NO3
InChI: InChI=1/C22H19Cl2NO3/c1-22(2)17(12-19(23)24)20(22)21(26)28-18(13-25)14-7-6-10-16(11-14)27-15-8-4-3-5-9-15/h3-12,17-18,20H,1-2H3
47 atoms
Cl 2.202189 0.039926 -1.532476
Cl 4.218348 -0.127196 0.52499
O  -2.089041 -2.043543 -0.161969
O  -2.250581 -2.010278 2.062972
O  -0.529637 2.702673 -0.980916
N  -4.122537 -1.5217 -2.712624
C  0.440076 -3.729125 0.170972
C  0.789124 -2.274774 0.058331
C  -0.218724 -2.738057 1.105294
C  -0.314138 -4.367196 -0.970655
C  1.409913 -4.683474 0.828431
C  2.063531 -1.711649 0.516776
C  -1.607488 -2.249685 1.073249
C  2.72427 -0.729012 -0.083567
C  -3.266723 -1.251368 -0.259522
C  -2.955988 0.196997 0.037677
C  -3.730792 -1.41631 -1.638401
C  -1.887556 0.805949 -0.613336
C  -3.68294 0.891372 0.991284
C  -1.556589 2.11053 -0.297969
C  -3.344008 2.204991 1.290303
C  -2.278718 2.819981 0.654311
C  0.624761 3.019905 -0.322931
C  0.983237 2.468689 0.901474
C  1.468721 3.91582 -0.968581
C  2.196979 2.826502 1.474004
C  2.67822 4.257899 -0.38494
C  3.048821 3.719829 0.841046
H  0.353559 -1.780982 -0.801827
H  0.15114 -2.775337 2.123824
H  0.396355 -4.848131 -1.645443
H  -0.892321 -3.661959 -1.562299
H  -0.992261 -5.140595 -0.604564
H  0.887955 -5.587642 1.146526
H  1.897678 -4.265163 1.708242
H  2.188314 -4.981482 0.123735
H  2.502783 -2.11098 1.423083
H  -4.057866 -1.620253 0.400693
H  -1.308754 0.276576 -1.361616
H  -4.506933 0.411642 1.503912
H  -3.910305 2.751256 2.032723
H  -2.012049 3.842347 0.892068
H  0.342711 1.758728 1.408977
H  1.179727 4.334932 -1.924746
H  2.475845 2.393183 2.425927
H  3.33249 4.954658 -0.893357
H  3.992801 3.991231 1.295056
elementType: Cl O N C H
totalener: -2050.68239066 hartree
nucrepener: 2957.02214350 hartree
electener: -5007.70453416 hartree
oneelecener: -8689.58033725 hartree
twoeener: 3681.87580309 hartree
cpcmener: -0.03248356 hartree
kineticenergy: 2044.47132961 hartree
xcener: -151.865563684720 hartree
chargesum: -0.0000000
charge: -0.059762 -0.062845 -0.280861 -0.430593 -0.321681 -0.083766 0.089733 0.033464 -0.054196 -0.257632 -0.272946 -0.216170 0.367048 0.074089 0.392556 -0.006007 -0.234780 -0.194664 -0.164861 0.192742 -0.128698 -0.148167 0.267093 -0.153414 -0.234866 -0.204174 -0.127967 -0.172809 0.084553 0.095466 0.095552 0.092558 0.100572 0.099874 0.091775 0.101897 0.127692 0.140918 0.139555 0.146451 0.160536 0.158033 0.146618 0.143648 0.155081 0.156853 0.156502
qa: -0.0598 -0.0628 -0.2809 -0.4306 -0.3217 -0.0838 0.0897 0.0335 -0.0542 -0.2576 -0.2729 -0.2162 0.3670 0.0741 0.3926 -0.0060 -0.2348 -0.1947 -0.1649 0.1927 -0.1287 -0.1482 0.2671 -0.1534 -0.2349 -0.2042 -0.1280 -0.1728 0.0846 0.0955 0.0956 0.0926 0.1006 0.0999 0.0918 0.1019 0.1277 0.1409 0.1396 0.1465 0.1605 0.1580 0.1466 0.1436 0.1551 0.1569 0.1565
va: 1.2655 1.2382 2.1179 2.0786 2.0628 3.1076 3.7542 3.8477 3.8311 3.9020 3.9202 3.9268 4.2123 4.1754 3.7718 3.6313 4.0714 4.0219 3.9533 3.8260 3.8888 3.9552 3.6568 3.7790 3.9806 3.8950 3.9107 3.8733 1.0276 1.0288 1.0001 1.0119 1.0007 1.0010 1.0054 1.0003 1.0219 1.0142 1.0218 1.0025 0.9895 0.9948 1.0058 1.0091 0.9955 0.9885 0.9896
dispcorr: -0.029616601 hartree
energy: -2050.712007257956
dipole: -7.43512 8.13700 0.70188 -10.89236 10.25393 -0.63843 8.50629 -6.81499 1.69130
magnitude: 1.93926 au
magnitude: 4.92921 debye
