program: Orca
programVersion: 5.0.2
elementType: Cl Cl O O O N C C C C C C C C C C C C C C C C C C C C C C H H H H H H H H H H H H H H H H H H H
charge: 0
multiplicity: 1
keywords: wb97x-d3
keywords: def2-TZVPP
keywords: def2/J RIJCOSX
keywords: DEFGRID2
keywords: scfconv7
keywords: smallprint printgap noloewdin
keywords: NOSOSCF
formula: C22H19Cl2NO3
InChI: InChI=1/C22H19Cl2NO3/c1-22(2)17(12-19(23)24)20(22)21(26)28-18(13-25)14-7-6-10-16(11-14)27-15-8-4-3-5-9-15/h3-12,17-18,20H,1-2H3
47 atoms
Cl 1.388696 -3.345059 -2.597741
Cl 3.980345 -4.47344 -2.0050
O  -0.823492 -0.416907 -0.821787
O  -1.826061 -2.200747 0.079913
O  -1.725571 4.072579 1.666352
N  -1.682823 1.44419 -3.412556
C  0.842678 -2.516996 1.658048
C  0.908532 -3.381269 0.447543
C  0.542968 -1.919687 0.288464
C  -0.256734 -2.748138 2.665157
C  2.131358 -2.045395 2.286423
C  2.196306 -3.867125 -0.096235
C  -0.821581 -1.571728 -0.133259
C  2.480319 -3.897294 -1.390301
C  -2.090659 0.108981 -1.204828
C  -2.638181 1.010354 -0.126379
C  -1.849831 0.849303 -2.444537
C  -1.902033 2.130523 0.245792
C  -3.833386 0.703139 0.503654
C  -2.373934 2.946159 1.262181
C  -4.299988 1.538272 1.511832
C  -3.577079 2.652944 1.89782
C  -0.378812 4.192853 1.420715
C  0.054547 5.241507 0.626138
C  0.524985 3.305172 1.990212
C  1.415542 5.406229 0.403414
C  1.880306 3.474891 1.751774
C  2.330247 4.522532 0.957842
H  0.07644 -4.069699 0.319773
H  1.316798 -1.271142 -0.105734
H  -1.13862 -3.222807 2.242136
H  -0.565327 -1.810467 3.131017
H  0.113761 -3.400696 3.457965
H  2.910275 -1.839219 1.551679
H  2.515683 -2.797582 2.978321
H  1.964136 -1.129258 2.855631
H  2.94213 -4.242279 0.595589
H  -2.803057 -0.688623 -1.433354
H  -0.973403 2.362985 -0.262418
H  -4.396758 -0.174418 0.213769
H  -5.232741 1.311057 2.011003
H  -3.939719 3.298724 2.687761
H  -0.66409 5.92329 0.188788
H  0.175299 2.490349 2.612674
H  1.757592 6.226044 -0.214967
H  2.587895 2.784471 2.192447
H  3.389249 4.650492 0.775931
elementType: Cl O N C H
totalener: -2050.68448353 hartree
nucrepener: 2796.20598929 hartree
electener: -4846.89047282 hartree
oneelecener: -8367.99209827 hartree
twoeener: 3521.10162545 hartree
cpcmener: -0.02996984 hartree
kineticenergy: 2044.48382927 hartree
xcener: -151.863722925518 hartree
chargesum: -0.0000000
charge: -0.048867 -0.054651 -0.282291 -0.447008 -0.327153 -0.086914 0.136223 -0.031270 -0.146771 -0.274403 -0.283365 -0.214819 0.403770 0.074145 0.417523 0.007112 -0.233197 -0.185949 -0.202811 0.245013 -0.109429 -0.230062 0.240748 -0.207059 -0.178028 -0.138750 -0.149998 -0.162826 0.115005 0.114153 0.096479 0.101915 0.096269 0.094972 0.102231 0.099426 0.139626 0.133298 0.143610 0.145330 0.158501 0.148081 0.147870 0.157915 0.158660 0.159234 0.158511
qa: -0.0489 -0.0547 -0.2823 -0.4470 -0.3272 -0.0869 0.1362 -0.0313 -0.1468 -0.2744 -0.2834 -0.2148 0.4038 0.0741 0.4175 0.0071 -0.2332 -0.1859 -0.2028 0.2450 -0.1094 -0.2301 0.2407 -0.2071 -0.1780 -0.1388 -0.1500 -0.1628 0.1150 0.1142 0.0965 0.1019 0.0963 0.0950 0.1022 0.0994 0.1396 0.1333 0.1436 0.1453 0.1585 0.1481 0.1479 0.1579 0.1587 0.1592 0.1585
va: 1.2823 1.2513 2.1246 2.0626 2.0811 3.1117 3.7063 3.8853 3.8572 3.8894 3.9205 3.9047 4.1464 4.1868 3.7343 3.6555 4.0877 3.9283 3.9556 3.7851 3.9039 4.0032 3.7308 3.9978 3.9338 3.8889 3.8904 3.8929 1.0203 1.0239 1.0182 0.9986 1.0017 0.9988 0.9997 1.0032 1.0083 1.0230 1.0164 1.0061 0.9891 1.0055 1.0050 0.9959 0.9894 0.9902 0.9902
dispcorr: -0.024734415 hartree
energy: -2050.709217940560
dipole: -6.96042 7.62490 0.66448 15.94607 -16.47888 -0.53281 30.22138 -27.72847 2.49292
magnitude: 2.63440 au
magnitude: 6.69611 debye
