program: Orca
programVersion: 5.0.2
elementType: Cl Cl O O O N C C C C C C C C C C C C C C C C C C C C C C H H H H H H H H H H H H H H H H H H H
charge: 0
multiplicity: 1
keywords: wb97x-d3
keywords: def2-TZVPP
keywords: def2/J RIJCOSX
keywords: DEFGRID2
keywords: scfconv7
keywords: smallprint printgap noloewdin
keywords: NOSOSCF
formula: C22H19Cl2NO3
InChI: InChI=1/C22H19Cl2NO3/c1-22(2)17(12-19(23)24)20(22)21(26)28-18(13-25)14-7-6-10-16(11-14)27-15-8-4-3-5-9-15/h3-12,17-18,20H,1-2H3
47 atoms
Cl 0.598522 -4.575156 0.813291
Cl 2.267685 -6.394335 -0.68604
O  -1.201345 -0.844978 -0.2900
O  0.596977 -0.312157 0.936543
O  -0.968028 4.717567 -0.25527
N  -4.215912 -1.372723 0.967278
C  2.087248 -1.283715 -1.658734
C  2.170399 -2.316861 -0.589026
C  0.81738 -1.755542 -0.958188
C  2.651545 0.08957 -1.392949
C  2.210968 -1.71401 -3.099734
C  2.4836 -3.730271 -0.89502
C  0.109127 -0.900514 0.005854
C  1.865018 -4.758978 -0.334203
C  -2.033015 -0.010184 0.513849
C  -2.295876 1.297355 -0.189646
C  -3.25875 -0.776295 0.75138
C  -1.515412 2.395406 0.156371
C  -3.24313 1.391587 -1.199614
C  -1.698257 3.599927 -0.510676
C  -3.411882 2.600789 -1.858719
C  -2.649636 3.705016 -1.519675
C  -0.200166 4.79418 0.880821
C  -0.793983 4.824263 2.135364
C  1.173964 4.894197 0.737333
C  0.00878 4.947611 3.259668
C  1.965885 5.02869 1.870331
C  1.388448 5.049845 3.131782
H  2.559627 -1.968347 0.364854
H  0.175168 -2.38648 -1.56191
H  2.090075 0.854868 -1.931978
H  3.68389 0.131151 -1.745179
H  2.658688 0.356362 -0.338265
H  1.760678 -2.688871 -3.288814
H  3.260498 -1.767916 -3.395056
H  1.72132 -0.992626 -3.756022
H  3.282641 -3.94269 -1.596498
H  -1.57804 0.17249 1.491826
H  -0.774547 2.297554 0.939346
H  -3.853375 0.540246 -1.474747
H  -4.151938 2.687327 -2.643073
H  -2.788613 4.648823 -2.0322
H  -1.870404 4.753699 2.234423
H  1.619028 4.87381 -0.24965
H  -0.449214 4.96897 4.239964
H  3.039688 5.110844 1.762366
H  2.009612 5.14891 4.012278
elementType: Cl O N C H
totalener: -2050.68460651 hartree
nucrepener: 2759.63029641 hartree
electener: -4810.31490292 hartree
oneelecener: -8294.91148667 hartree
twoeener: 3484.59658375 hartree
cpcmener: -0.02883039 hartree
kineticenergy: 2044.47918328 hartree
xcener: -151.863175945367 hartree
chargesum: -0.0000000
charge: -0.048874 -0.055471 -0.273575 -0.447089 -0.322041 -0.088683 0.133806 -0.026314 -0.159091 -0.274193 -0.281644 -0.216714 0.423105 0.073668 0.393669 -0.025728 -0.222249 -0.167133 -0.218577 0.297303 -0.115485 -0.238032 0.251731 -0.185657 -0.209360 -0.144631 -0.138066 -0.163566 0.111720 0.112863 0.101096 0.097710 0.095659 0.095232 0.101661 0.100583 0.139413 0.131756 0.135758 0.140598 0.158775 0.146637 0.156430 0.146887 0.159192 0.157899 0.159021
qa: -0.0489 -0.0555 -0.2736 -0.4471 -0.3220 -0.0887 0.1338 -0.0263 -0.1591 -0.2742 -0.2816 -0.2167 0.4231 0.0737 0.3937 -0.0257 -0.2222 -0.1671 -0.2186 0.2973 -0.1155 -0.2380 0.2517 -0.1857 -0.2094 -0.1446 -0.1381 -0.1636 0.1117 0.1129 0.1011 0.0977 0.0957 0.0952 0.1017 0.1006 0.1394 0.1318 0.1358 0.1406 0.1588 0.1466 0.1564 0.1469 0.1592 0.1579 0.1590
va: 1.2811 1.2503 2.1214 2.0635 2.0897 3.1102 3.7136 3.8734 3.8536 3.8961 3.9161 3.9012 4.1406 4.1894 3.7341 3.7481 4.0728 3.8759 4.0031 3.7348 3.9180 4.0167 3.7044 3.9427 4.0008 3.8892 3.8878 3.8921 1.0229 1.0245 0.9990 1.0019 1.0170 0.9988 0.9997 1.0027 1.0086 1.0263 1.0249 1.0097 0.9896 1.0072 0.9969 1.0052 0.9900 0.9898 0.9900
dispcorr: -0.024270168 hartree
energy: -2050.708876673748
dipole: 7.59399 -5.73930 1.85469 36.13590 -34.74960 1.38630 -8.79653 7.62068 -1.17586
magnitude: 2.59699 au
magnitude: 6.60101 debye
