program: Gaussian 09
title: 000074440
version: EM64L-G09RevD.01
frameworkgroup: C1[X(C9H9FN2O2)]
method: RPBEPBE
basis: SDD
operation: Freq
keyword: #p
keyword: freq=noraman
keyword: PBEPBE/SDD
title: #p freq=noraman PBEPBE/SDD
converged: NO YES NO NO
title: Mulliken charges:
elementType: F O O N N C C C C C C C C C H H H H H H H H H
charge: -0.201308 -0.205736 -0.145225 -0.503166 -0.476346 0.482975 -0.442153 -0.333697 -0.196259 -0.211375 0.324351 -0.253395 0.227867 -0.309041 0.289869 0.213394 0.305977 0.228405 0.230478 0.232138 0.292204 0.224650 0.225391
chargesum: 0.00000
title: Mulliken charges with hydrogens summed into heavy atoms:
elementType: F O O N N C C C C C C C C C
charge: -0.201308 -0.205736 -0.145225 -0.213297 -0.184141 0.482975 -0.228759 -0.027721 0.032146 0.019104 0.324351 -0.021257 0.227867 0.141001
polarizability: 1.96733666e+02 -4.18972158e+00 1.21346582e+02 -1.13908122e-02 5.82626019e-03 5.19686708e+01
1716.lowfreq: -42.5844 -24.4837 -7.5178 -3.5331 -0.0011 -0.0008 -0.0006 8.6883 37.5572
frequency: -42.5804 -24.4209 37.5430 61.3787 75.4656 104.7051 185.0835 233.9508 235.8988 277.7946 337.2074 371.3780 406.9093 452.0394 525.6613 534.9935 537.9475 613.1907 620.4768 667.2591 695.4302 710.2442 742.0982 767.7832 818.2528 839.9397 916.8167 933.6411 945.8825 972.8731 984.5810 1000.7941 1001.5495 1026.4482 1043.7343 1092.0087 1131.1182 1156.3292 1174.1636 1186.2259 1192.0197 1262.2245 1321.9436 1337.0406 1383.2620 1428.7496 1445.5936 1449.7046 1486.4632 1515.6023 1603.0235 1615.1512 1668.0005 1706.6721 2978.6304 3044.3900 3104.2547 3135.0708 3146.4238 3167.6797 3198.5966 3491.0073 3522.1448
redmass: 3.8358 3.7276 6.3299 4.9562 7.2060 4.6033 6.4874 8.5798 3.2021 10.9209 8.3869 7.5456 2.9189 1.4801 2.4525 8.0976 3.2119 6.4415 1.1734 7.2777 1.9999 10.6838 6.1416 1.6915 6.0526 1.2703 1.4203 6.9870 8.9172 1.3533 6.1598 1.9645 1.3217 2.3568 5.4114 1.5719 2.4706 3.9125 1.0518 1.0723 1.1125 2.2188 1.4430 1.3570 6.2257 2.2949 1.4188 1.3058 2.3160 1.9531 5.0434 6.0394 4.2719 9.9367 1.0545 1.1078 1.0890 1.0867 1.0932 1.0998 1.0950 1.0766 1.0760
irintensity: 5.6980 2.4995 0.0136 8.6478 2.7688 3.0824 2.9396 0.3591 1.8624 1.0149 2.4577 0.6551 0.0353 4.0948 22.5076 22.2415 10.7918 1.3114 129.7560 7.2056 54.1973 21.5143 1.9807 102.4907 1.9613 0.0354 13.7552 35.5575 1.8338 0.2359 0.5508 0.2815 3.1135 29.8763 54.5508 15.8685 577.4444 56.1464 0.8473 0.0773 0.5198 13.3159 43.4502 15.1993 75.9992 115.5865 401.4133 392.8046 17.3758 176.0864 26.0267 42.7939 9.3417 328.3939 27.6832 21.9585 18.4285 0.1901 27.7032 22.1680 6.7138 1.6469 12.1679
temp: 298.150 k
press: 1.00000 atm
elementType: 9 8 8 7 7 6 6 6 6 6 6 6 6 6 1 1 1 1 1 1 1 1 1
symmnumber: 1
zpe: 446341.3 jmol-1
zpe.correction: 0.170002 hartree
zpe.thermalcorrener: 0.181487 hartree
zpe.thermalcorrenthalpy: 0.182431 hartree
zpe.thermalcorrgfe: 0.130941 hartree
zpe.sumelectzpe: -707.138842 hartree
zpe.sumelectthermal: -707.127357 hartree
zpe.sumelectthermalent: -707.126413 hartree
zpe.sumelectthermalfe: -707.177903 hartree
dipole: 3.3733 -7.5716 0.0162
dipole: 8.2890
quadrupole: -91.2148 -75.3215 -83.1243
quadrupole: 15.3831 -0.0812 0.0037
quadrupole: -7.9946 7.8987 0.0959 15.3831 -0.0812 0.0037
hfenergy: -707.3088442 hartree
pointgroup: C01 [X(C9H9F1N2O2)]
dipole: -1.3833752 -2.9531956 -0.0073287 debye
dipolederiv: -0.7975219 -0.0386552 -0.0016727 -0.1426454 -0.2326023 -0.0005914 -0.0031822 -0.0001183 -0.2453637 -0.6711035 0.0649562 0.0001728 -0.1783102 -0.8285937 0.0002516 0.0004096 0.0002546 -0.3245142 -0.7401247 -0.0659788 0.0001533 -0.5416518 -0.7387067 -0.0014545 0.0000575 -0.0011182 -0.2804489 -1.9801436 -0.1762121 0.0002713 -0.491043 -0.3577631 0.0000017 0.0003047 -0.0000586 -0.3547515 -2.4739963 0.0151733 0.0004078 0.2108434 -0.3936354 -0.0001178 0.0000158 -0.0003349 -0.3984736 1.3014442 -0.0642418 -0.0000455 -0.3508099 0.0432762 0.0000765 0.0000381 0.0000275 0.1019329 -0.3075735 0.0090838 0.0000231 -0.1348234 0.0501616 -0.0000901 0.0000871 -0.0001208 -0.2191655 -0.2813759 0.0230844 0.00002 0.2191242 -0.083083 -0.0000617 -0.0000807 -0.0000082 -0.1644078 0.0897727 0.0058769 -0.0000041 0.1135616 0.1146246 -0.0001033 -0.0000581 -0.0001034 -0.1368151 0.0834176 -0.0142008 0.0000083 -0.0898119 0.1648876 -0.0001098 0.0000285 -0.0001105 -0.1383471 2.7446682 0.0241855 -0.0003853 0.2133363 1.2460774 -0.000546 -0.0008412 -0.0003734 0.3475191 -0.0370216 -0.0437984 0.000024 -0.0461829 -0.1449694 -0.0000153 0.0000075 -0.0000141 -0.1827214 2.0787787 0.1217813 -0.0012216 0.8030343 0.9753104 0.0026299 -0.0018248 0.002556 0.1913677 0.6575925 0.1622018 0.0021277 0.353707 0.1119406 -0.0013044 0.0048835 -0.0021793 0.424629 0.1430172 0.0048022 0.00002 0.069035 0.0731003 0.0001173 0.0000389 0.0001289 0.313628 0.032126 0.1145448 -0.0000452 0.0908336 -0.0914399 0.0000998 -0.0000264 0.0000977 0.1692999 0.1546136 -0.05814 0.0000122 -0.0485972 0.0747291 0.0000478 0.000021 0.000036 0.182734 -0.0114305 -0.0983581 0.0000442 -0.1168141 -0.0376202 0.0000831 0.0000451 0.0000812 0.1584817 0.0510909 0.0548808 -0.0000231 0.0824751 -0.085994 0.0000913 -0.0000333 0.0000921 0.1537373 -0.1256572 0.036342 -0.0000074 0.0374767 0.0846889 0.0000332 -0.0000056 0.0000333 0.1702348 0.1302661 -0.0185719 -0.0001203 0.009983 0.0375422 -0.0000884 0.0002898 0.0001285 0.3168394 -0.0204492 -0.0302914 0.0358655 -0.0320283 0.0075 0.0780826 0.0406536 0.1113845 -0.0413165 -0.0203897 -0.0284643 -0.0356251 -0.030692 0.0105685 -0.0770321 -0.0408285 -0.110281 -0.0440785 unknown
polarizability: 196.8653612|2.7583235|121.2148837|-0.0077808|0.0163841|51.9686738 unknown
InChI: InChI=1S/C9H9FN2O2/c10-6-8(13)12-9(14)11-7-4-2-1-3-5-7/h1-5,11-12H,6H2
charge 0 multiplicity 1
23 atoms
F  5.597559 -0.462317 0.003748
O  0.596915 1.484632 -0.000225
O  3.489632 1.288415 0.00277
N  -0.421373 -0.642494 0.000444
N  1.915355 -0.488675 -0.000128
C  -1.808106 -0.300105 0.000392
C  -2.734454 -1.378675 0.00085
C  -2.284356 1.037798 -0.000107
C  -4.120584 -1.126259 0.000782
C  -3.676721 1.271327 -0.000175
C  0.670929 0.235632 0.000001
C  -4.602269 0.203521 0.000254
C  3.216337 0.074778 0.000213
C  4.287813 -1.044999 -0.004456
H  -0.237218 -1.648219 0.000972
H  -2.370634 -2.415307 0.001259
H  -1.572732 1.864769 -0.000414
H  -4.821856 -1.967907 0.001137
H  -4.037153 2.306026 -0.000572
H  -5.679035 0.401728 0.000195
H  1.869071 -1.512479 -0.000527
H  4.187465 -1.679826 0.898309
H  4.192716 -1.666163 -0.917223
