program: Gaussian 09
title: 000074439
version: EM64L-G09RevD.01
frameworkgroup: C1[X(C9H8F4O)]
method: RPBEPBE
basis: SDD
operation: Freq
keyword: #pfreq=noraman
keyword: PBEPBE/SDD
title: #p freq=noraman PBEPBE/SDD
converged: YES YES NO NO
title: Mulliken charges:
elementType: F F F F O C C C C C C C C C H H H H H H H H
charge: -0.156457 -0.177948 -0.169655 -0.164026 -0.265305 0.389551 0.438341 0.319760 -0.373653 -0.307101 -0.356967 -0.375573 0.054612 -0.802205 0.259387 0.283262 0.239209 0.237464 0.231992 0.228259 0.226808 0.240244
chargesum: 0.00000
title: Mulliken charges with hydrogens summed into heavy atoms:
elementType: F F F F O C C C C C C C C C
charge: -0.156457 -0.177948 -0.169655 -0.164026 -0.265305 0.389551 0.438341 0.319760 -0.114267 -0.023839 -0.117758 -0.138109 0.286605 -0.106894
polarizability: 1.43514278e+02 2.32954778e+00 9.94278942e+01 4.60642073e+00 -4.74895605e+00 5.88240310e+01
1716.lowfreq: -29.9545 -7.7170 -0.0012 -0.0011 -0.0001 1.6010 5.1037 25.8738 49.7818
frequency: -29.3629 25.3945 49.7501 59.3220 82.5131 141.2679 180.0752 228.9376 258.2077 280.7483 314.3518 353.0804 364.1255 408.5180 452.8002 465.9153 500.2518 520.1847 537.0810 625.3629 695.9517 703.3042 718.5580 771.8072 822.0203 823.1459 833.0913 932.3232 948.3810 969.0683 988.4594 1002.5350 1008.8826 1014.9025 1048.6192 1100.7658 1123.6785 1154.6709 1195.7341 1220.6391 1229.3027 1294.7432 1311.8179 1339.9544 1379.2612 1400.4748 1412.0116 1473.6594 1473.9798 1499.2362 1601.5914 1621.0814 2978.1965 3059.8517 3088.5632 3092.3233 3135.4159 3137.9273 3172.5180 3187.6941
redmass: 1.0231 5.3883 6.2537 12.5830 7.7245 4.8563 9.4722 13.0374 5.0977 13.1450 5.0206 4.9308 4.7438 2.9268 9.0195 8.9545 3.2571 7.5467 8.3526 7.2004 7.5095 3.3431 6.2002 6.0887 4.8201 1.4939 1.3016 7.4896 1.3731 1.3742 1.3995 8.5664 3.5654 5.4137 1.5542 7.8979 1.3608 2.7983 1.1670 2.8344 3.9262 1.1422 1.2747 1.8240 6.6659 1.2221 2.9325 1.0627 1.0933 2.5063 6.8278 6.5422 1.0389 1.0950 1.0998 1.0881 1.0902 1.0904 1.0958 1.0951
irintensity: 0.6983 0.1167 0.7249 0.8962 0.8209 0.3228 3.0570 3.6349 3.5024 2.3947 2.2591 1.2101 4.8041 0.0646 11.8633 16.1917 6.8403 2.3314 3.2545 2.6755 40.6633 3.7422 27.1033 34.4144 34.1021 37.3278 18.8863 132.1140 18.9007 0.3914 0.1366 173.1912 2.6486 28.8756 23.9457 478.8244 37.2772 143.8348 6.2084 105.5736 192.6467 2.5893 1.1392 16.5576 8.0596 13.2169 0.2148 14.0242 14.2121 121.3360 3.4824 4.0086 30.1196 21.0231 16.8478 15.1020 15.1831 12.3483 3.1454 0.2706
temp: 298.150 k
press: 1.00000 atm
elementType: 9 9 9 9 8 6 6 6 6 6 6 6 6 6 1 1 1 1 1 1 1 1
symmnumber: 1
zpe: 399636.6 jmol-1
zpe.correction: 0.152214 hartree
zpe.thermalcorrener: 0.164872 hartree
zpe.thermalcorrenthalpy: 0.165816 hartree
zpe.thermalcorrgfe: 0.111371 hartree
zpe.sumelectzpe: -821.296405 hartree
zpe.sumelectthermal: -821.283746 hartree
zpe.sumelectthermalent: -821.282802 hartree
zpe.sumelectthermalfe: -821.337247 hartree
dipole: 3.8423 0.9237 -1.5281
dipole: 4.2369
quadrupole: -73.3054 -76.5729 -82.2132
quadrupole: -2.5731 6.6774 -3.4013
quadrupole: 4.0584 0.7909 -4.8494 -2.5731 6.6774 -3.4013
hfenergy: -821.4486182 hartree
pointgroup: C01 [X(C9H8F4O1)]
dipole: -1.5233768 0.3308721 0.5903231 debye
dipolederiv: -0.4509648 -0.0178592 -0.0361053 0.2091528 -0.354271 -0.2156077 0.2407327 -0.1628398 -0.7149039 -0.474031 -0.0181822 0.0083936 0.3310512 -0.5950323 0.2875554 -0.169024 0.2378764 -0.525799 -0.3943191 -0.0688294 0.0331068 -0.0631126 -0.5657325 0.1955237 0.0315098 0.2809022 -0.4216629 -0.7314407 0.2271792 -0.0159667 0.2169247 -0.4585895 0.0212623 0.0920328 -0.0457107 -0.2492487 -2.1914268 0.1860747 -0.014946 0.3719869 -0.4559671 -0.0052551 -0.0077907 -0.0426242 -0.3671771 1.4740944 0.0219552 0.0620766 0.1973109 0.1198733 -0.0093097 0.1394144 0.0024178 0.1005885 0.3797244 0.0770543 0.0574373 0.0469707 -0.0900456 0.0018562 0.1236132 0.0092531 -0.0205182 1.7801729 -0.1878296 -0.0077673 -1.1354708 1.1469969 -0.0537453 -0.2671523 -0.0525366 1.3967332 -0.2513463 0.0069592 0.0043756 0.0816478 0.0161478 0.0335255 0.0080089 0.0162681 -0.1426265 -0.2113088 -0.0117936 -0.0038003 -0.141236 -0.0568264 -0.0023349 -0.0413252 0.0049101 -0.1247839 -0.0325924 -0.0473953 0.0051873 -0.1446214 0.0735788 0.0117766 -0.0136449 0.0185358 -0.1619464 -0.1187308 -0.0146361 0.0051221 0.089854 0.1237025 0.0471984 0.0057475 0.0428897 -0.1529734 1.1565471 -0.1620309 -0.0098356 -0.0656295 1.0432988 -0.1773906 -0.0674312 -0.1948266 0.7214218 -0.128328 -0.0304815 -0.0294737 -0.0178986 0.0750316 -0.0014788 -0.1351877 -0.0159724 0.0537705 0.0830045 -0.0625221 -0.0144757 -0.0683156 -0.0098785 -0.0281932 -0.0126538 -0.0262167 0.1700444 0.0538168 0.0589021 -0.0031926 0.0763927 0.054688 -0.0094813 0.0044457 -0.0075753 0.1665899 -0.0146671 0.1037936 0.0055807 0.0916815 -0.0147843 -0.0130769 0.004799 -0.0166505 0.149647 0.0393396 -0.070967 -0.0123131 -0.0694493 -0.0642788 -0.031878 -0.0109968 -0.0285387 0.1446684 0.0256023 -0.0002485 -0.0216949 -0.0055789 0.0182061 -0.0438254 0.0337659 -0.020553 -0.0551268 0.0365895 -0.010796 0.0005737 -0.0998423 -0.1014339 0.0722477 0.0452741 0.0652323 0.0896295 -0.0126256 0.0353366 0.0382198 0.1082409 -0.0168678 -0.0985318 0.0981043 -0.0752492 0.0494671 -0.0171101 -0.0136833 -0.0505023 -0.010059 0.1121836 0.019163 -0.1022418 0.0110081 -0.1057935 unknown
polarizability: 143.5874362|-0.9468635|99.5107687|4.72254|4.0522172|58.6679983 unknown
InChI: InChI=1S/C9H8F4O/c1-6-2-4-7(5-3-6)14-9(12,13)8(10)11/h2-5,8H,1H3
charge 0 multiplicity 1
22 atoms
F  1.772326 -0.838437 -1.203991
F  1.844017 -1.360282 1.013618
F  3.273884 1.563831 -0.668188
F  4.259147 -0.384249 0.035579
O  0.819588 0.644941 0.344052
C  -0.572276 0.288871 0.177351
C  -3.349652 -0.161284 -0.072145
C  1.845067 -0.239467 0.092155
C  -1.453735 1.381117 0.256854
C  -1.032871 -1.027566 -0.016703
C  -2.839102 1.146934 0.134042
C  -2.424686 -1.233754 -0.141093
C  3.1860 0.50957 0.279652
C  -4.8398 -0.401058 -0.237761
H  -1.053687 2.387401 0.411098
H  -0.343353 -1.872993 -0.067757
H  -3.531043 1.994502 0.197596
H  -2.793999 -2.254664 -0.292468
H  3.284635 0.926715 1.295773
H  -5.129689 -1.408148 0.109183
H  -5.4344 0.338441 0.326588
H  -5.139172 -0.321022 -1.300833
