program: Orca
programVersion: 5.0.2
elementType: Cl Cl O O O N C C C C C C C C C C C C C C C C C C C C C C H H H H H H H H H H H H H H H H H H H
charge: 0
multiplicity: 1
keywords: wb97x-d3
keywords: def2-TZVPP
keywords: def2/J RIJCOSX
keywords: DEFGRID2
keywords: scfconv7
keywords: smallprint printgap noloewdin
keywords: NOSOSCF
formula: C22H19Cl2NO3
InChI: InChI=1/C22H19Cl2NO3/c1-22(2)17(12-19(23)24)20(22)21(26)28-18(13-25)14-7-6-10-16(11-14)27-15-8-4-3-5-9-15/h3-12,17-18,20H,1-2H3
47 atoms
Cl 1.96898 -6.085492 1.183645
Cl 1.068052 -7.510642 -1.158397
O  -1.110277 -0.894821 -0.593636
O  0.500329 -1.052924 0.947842
O  -0.528945 4.470513 1.83836
N  -4.285484 -0.000112 -0.490582
C  2.104952 -2.419549 -1.370058
C  1.464466 -3.498657 -0.548395
C  0.620378 -2.347831 -1.071207
C  3.083466 -1.501355 -0.680059
C  2.469825 -2.687542 -2.810728
C  1.211649 -4.840392 -1.087633
C  0.047713 -1.385109 -0.116187
C  1.393933 -5.981123 -0.43501
C  -1.763248 0.094042 0.18555
C  -1.220288 1.48041 -0.074742
C  -3.17334 0.025944 -0.205834
C  -1.103537 2.36598 0.984908
C  -0.89595 1.875655 -1.367267
C  -0.657108 3.660508 0.750521
C  -0.440587 3.166378 -1.582428
C  -0.317249 4.066056 -0.533777
C  -0.705104 5.823768 1.691764
C  0.295573 6.664621 2.152216
C  -1.875384 6.337898 1.147827
C  0.118461 8.03963 2.071821
C  -2.035028 7.71278 1.064862
C  -1.041453 8.568279 1.524252
H  1.689005 -3.449307 0.511191
H  -0.024163 -2.578207 -1.91172
H  4.09525 -1.885527 -0.821956
H  2.915931 -1.415726 0.39068
H  3.049816 -0.498738 -1.110577
H  2.605691 -1.74493 -3.343729
H  1.71335 -3.257509 -3.349017
H  3.410197 -3.238702 -2.870383
H  0.840889 -4.915742 -2.102974
H  -1.709765 -0.139485 1.253766
H  -1.359288 2.057841 1.992004
H  -0.99658 1.193254 -2.201267
H  -0.176503 3.482782 -2.582856
H  0.046532 5.067637 -0.724157
H  1.201507 6.247577 2.573945
H  -2.657459 5.675255 0.797502
H  0.897977 8.697888 2.433204
H  -2.946327 8.116132 0.642519
H  -1.173388 9.640258 1.45827
elementType: Cl O N C H
totalener: -2050.68639447 hartree
nucrepener: 2628.03481063 hartree
electener: -4678.72120510 hartree
oneelecener: -8031.41268735 hartree
twoeener: 3352.69148225 hartree
cpcmener: -0.03148330 hartree
kineticenergy: 2044.47378903 hartree
xcener: -151.862932037036 hartree
chargesum: 0.0000000
charge: -0.054189 -0.059284 -0.286611 -0.441198 -0.327047 -0.087442 0.092670 0.031744 -0.082313 -0.269059 -0.263685 -0.198518 0.385446 0.038953 0.401666 0.032943 -0.226655 -0.227944 -0.205990 0.240331 -0.153312 -0.154359 0.237888 -0.220461 -0.164262 -0.134051 -0.151794 -0.168668 0.084217 0.096051 0.097753 0.096230 0.100111 0.098446 0.090661 0.101896 0.129718 0.139529 0.133999 0.146611 0.159798 0.157587 0.146789 0.159742 0.158551 0.158913 0.158602
qa: -0.0542 -0.0593 -0.2866 -0.4412 -0.3270 -0.0874 0.0927 0.0317 -0.0823 -0.2691 -0.2637 -0.1985 0.3854 0.0390 0.4017 0.0329 -0.2267 -0.2279 -0.2060 0.2403 -0.1533 -0.1544 0.2379 -0.2205 -0.1643 -0.1341 -0.1518 -0.1687 0.0842 0.0961 0.0978 0.0962 0.1001 0.0984 0.0907 0.1019 0.1297 0.1395 0.1340 0.1466 0.1598 0.1576 0.1468 0.1597 0.1586 0.1589 0.1586
va: 1.2715 1.2453 2.1196 2.0720 2.0704 3.1137 3.7213 3.8826 3.8556 3.9035 3.9101 3.8946 4.1872 4.2137 3.7168 3.6575 4.0767 4.0824 3.9592 3.7829 3.9330 3.8872 3.7228 3.9984 3.9149 3.8882 3.8949 3.8923 1.0442 1.0341 1.0002 1.0188 0.9995 1.0016 1.0057 1.0007 1.0184 1.0230 1.0181 1.0133 0.9916 0.9963 1.0062 0.9949 0.9892 0.9904 0.9900
dispcorr: -0.022638591 hartree
energy: -2050.709033062593
dipole: 6.16559 -4.61920 1.54639 43.35301 -41.90271 1.45030 -9.01191 7.67575 -1.33616
magnitude: 2.50600 au
magnitude: 6.36973 debye
