program: Gaussian 09
title: 000074438
version: EM64L-G09RevD.01
frameworkgroup: C1[X(C9H8F4O)]
method: RPBEPBE
basis: SDD
operation: Freq
keyword: #pfreq=noraman
keyword: PBEPBE/SDD
title: #p freq=noraman PBEPBE/SDD
converged: YES YES NO NO
title: Mulliken charges:
elementType: F F F F O C C C C C C C C C H H H H H H H H
charge: -0.156106 -0.176908 -0.169516 -0.163946 -0.270480 0.416627 0.468571 -0.532720 0.321304 -0.338781 -0.402524 -0.201894 0.053761 -0.798734 0.263583 0.287117 0.237272 0.232780 0.231843 0.228995 0.241956 0.227801
chargesum: 0.00000
title: Mulliken charges with hydrogens summed into heavy atoms:
elementType: F F F F O C C C C C C C C C
charge: -0.156106 -0.176908 -0.169516 -0.163946 -0.270480 0.416627 0.468571 -0.269137 0.321304 -0.051664 -0.165253 0.030886 0.285604 -0.099982
polarizability: 1.37470025e+02 6.15714667e+00 1.04729088e+02 3.76065238e+00 -4.54803034e+00 5.86664946e+01
1716.lowfreq: -10.1924 -5.5321 -0.0011 -0.0009 0.0005 1.6847 16.6645 17.9923 54.8510
frequency: 14.9853 17.8755 54.8305 61.1281 85.6587 187.7064 194.0408 222.0316 225.7908 232.9359 285.9231 353.3339 373.8249 436.8975 459.6860 473.1411 510.5286 525.0559 553.3938 589.1946 685.8514 695.6367 714.6925 766.0891 786.8433 881.0122 905.3233 909.0784 935.7736 978.1392 987.5129 999.4777 1003.6711 1014.2208 1048.4157 1095.7836 1107.0229 1128.5181 1188.0258 1215.7255 1243.9892 1294.9949 1302.2542 1340.7423 1383.7952 1398.8997 1439.2983 1473.0978 1475.8389 1481.3587 1590.5476 1628.1558 2980.1591 3062.6234 3090.5852 3091.3767 3133.5752 3154.9117 3158.3412 3192.4551
redmass: 1.8506 1.6514 9.5599 9.7354 7.5831 9.8117 3.7212 4.2311 5.7420 8.2678 14.0131 12.0532 3.3792 3.1184 8.2529 10.9368 5.2734 9.9036 4.4036 8.4221 2.3383 7.8242 7.3699 6.6896 1.3765 1.3385 3.3783 1.4962 8.2947 1.3397 6.2304 1.6185 6.3500 6.7438 1.5628 2.5780 2.1351 2.4997 1.0978 2.7701 3.5754 1.1435 1.3263 1.8153 7.1083 1.2229 2.1579 1.0613 1.3378 2.1660 5.8956 7.0561 1.0385 1.0954 1.1000 1.0881 1.0880 1.0930 1.0946 1.0961
irintensity: 0.3423 0.5100 0.6177 1.0898 0.6249 3.6123 1.3787 0.7136 5.2625 3.1104 2.3676 2.6011 1.5693 7.9929 7.5348 5.4406 0.6537 3.0285 0.6539 2.9527 20.0902 59.8129 2.9280 51.9928 55.8066 15.9012 10.8203 7.0547 143.0382 0.8817 8.7089 10.7542 164.9889 22.2656 19.3051 191.8977 217.7299 278.6435 2.6491 122.3406 146.0329 2.3450 2.1886 19.6133 10.1480 13.0285 8.7704 13.3652 21.8740 63.3604 42.3844 40.0512 25.5846 19.6890 16.9151 15.1617 7.6087 13.3910 7.8041 0.1989
temp: 298.150 k
press: 1.00000 atm
elementType: 9 9 9 9 8 6 6 6 6 6 6 6 6 6 1 1 1 1 1 1 1 1
symmnumber: 1
zpe: 399683.0 jmol-1
zpe.correction: 0.152231 hartree
zpe.thermalcorrener: 0.165804 hartree
zpe.thermalcorrenthalpy: 0.166748 hartree
zpe.thermalcorrgfe: 0.108705 hartree
zpe.sumelectzpe: -821.296852 hartree
zpe.sumelectthermal: -821.283279 hartree
zpe.sumelectthermalent: -821.282335 hartree
zpe.sumelectthermalfe: -821.340379 hartree
dipole: 3.8814 0.8532 -1.4893
dipole: 4.2440
quadrupole: -75.1008 -75.4273 -82.1799
quadrupole: -1.4087 5.8169 -3.9078
quadrupole: 2.4685 2.1420 -4.6106 -1.4087 5.8169 -3.9078
hfenergy: -821.4490833 hartree
pointgroup: C01 [X(C9H8F4O1)]
dipole: -1.532896 -0.3085282 -0.5856374 debye
dipolederiv: -0.4821581 0.0221611 -0.0044701 -0.1838143 -0.3311405 -0.2118267 -0.2623369 -0.1314594 -0.7125151 -0.515862 -0.0007211 0.0338066 -0.3260782 -0.5590267 0.2890046 0.1957069 0.215658 -0.5242335 -0.3769276 0.0430082 -0.005465 0.0375769 -0.5773792 0.1980216 0.0115542 0.2783441 -0.4203375 -0.791613 -0.1871532 0.0304221 -0.1641201 -0.3978079 0.0224067 -0.0834247 -0.0277194 -0.2474988 -2.2211663 0.0053438 0.0392755 -0.0947927 -0.416078 -0.0048705 0.0403849 -0.0419312 -0.3708131 1.4545101 -0.1397724 -0.0863186 -0.3900671 0.2648122 0.0201689 -0.1681355 0.0361041 0.1328829 0.3175339 0.1885336 -0.0092531 0.211845 0.2311646 0.0072447 -0.0575592 -0.028806 -0.0239914 -0.4263285 -0.1014469 -0.0051108 -0.0743801 -0.0316769 0.0227833 0.0047641 0.0232261 -0.1707237 1.9578915 0.1093523 -0.0033501 0.9770244 0.9984694 -0.0722785 0.2482483 -0.0904327 1.3891531 -0.2637129 0.0395993 0.0142421 0.175099 -0.162232 -0.0066214 0.0456159 -0.0052653 -0.1552549 -0.0256502 -0.0892421 -0.0303016 -0.1570587 -0.1965212 0.0181307 -0.0344129 0.0143082 -0.174049 0.0957439 -0.0070914 -0.0176294 -0.0050117 0.1461769 0.034222 -0.0087594 0.0456152 -0.1229865 1.1816851 0.149423 -0.0253369 0.040405 1.0015296 -0.1793988 0.0230845 -0.2043179 0.7192179 -0.0503814 -0.1067319 0.0038771 -0.1244834 -0.0489946 0.0044683 0.0809148 0.0658266 0.0620123 0.1107985 0.0264584 0.0055505 0.0410747 -0.0313208 -0.0323446 0.008376 -0.0336563 0.1625963 0.0407323 -0.0571932 0.0032431 -0.0714723 0.0752109 -0.010936 -0.002248 -0.010308 0.1716694 -0.1039145 0.0554038 0.0244348 0.0410278 0.082776 -0.0169515 0.0179565 -0.0173961 0.1545497 0.0622401 0.0314899 0.0090042 0.0385801 -0.0906067 -0.0370061 0.0086005 -0.0381354 0.1482774 0.026523 -0.002194 0.0122684 0.0024163 0.0182533 -0.0463038 -0.0384063 -0.0159381 -0.0549591 0.054793 0.0521486 0.0597787 -0.0104925 -0.0439709 -0.1058802 -0.006131 -0.1293335 0.0231691 0.0481874 -0.0593268 0.0144822 -0.0736833 0.0373774 0.0658147 0.0503711 0.0930965 -0.0767137 -0.0929242 0.0279511 -0.0631496 0.1104051 0.0309851 0.0421525 -0.0741638 0.0025204 0.0905482 unknown
polarizability: 137.6757126|5.5762195|104.5203367|-3.6974609|4.6190836|58.6695593 unknown
InChI: InChI=1S/C9H8F4O/c1-6-3-2-4-7(5-6)14-9(12,13)8(10)11/h2-5,8H,1H3
charge 0 multiplicity 1
22 atoms
F  1.842767 0.764124 1.202997
F  1.942586 1.287875 -1.013571
F  2.951128 -1.828545 0.624597
F  4.200411 -0.049747 -0.107308
O  0.637297 -0.541231 -0.329499
C  -0.680934 0.020653 -0.127997
C  -3.059128 -0.521492 -0.044843
C  -1.712503 -0.931524 -0.199748
C  1.792336 0.173588 -0.097829
C  -0.925034 1.39035 0.088928
C  -3.324331 0.855518 0.175266
C  -2.270839 1.792701 0.243333
C  2.998031 -0.770224 -0.321139
C  -4.185235 -1.53887 -0.086145
H  -1.457136 -1.982261 -0.370992
H  -0.115424 2.121336 0.135282
H  -4.36055 1.19216 0.293001
H  -2.492168 2.851808 0.412258
H  3.004874 -1.193757 -1.339408
H  -3.951536 -2.37928 -0.762764
H  -4.367471 -1.966486 0.918697
H  -5.130043 -1.079096 -0.424117
