program: Orca
programVersion: 5.0.2
elementType: Cl Cl O O O N C C C C C C C C C C C C C C C C C C C C C C H H H H H H H H H H H H H H H H H H H
charge: 0
multiplicity: 1
keywords: wb97x-d3
keywords: def2-TZVPP
keywords: def2/J RIJCOSX
keywords: DEFGRID2
keywords: scfconv7
keywords: smallprint printgap noloewdin
keywords: NOSOSCF
formula: C22H19Cl2NO3
InChI: InChI=1/C22H19Cl2NO3/c1-22(2)17(12-19(23)24)20(22)21(26)28-18(13-25)14-7-6-10-16(11-14)27-15-8-4-3-5-9-15/h3-12,17-18,20H,1-2H3
47 atoms
Cl 0.64735 -4.232485 1.241329
Cl 2.549702 -6.036583 0.028694
O  -1.435262 -0.976137 -0.349777
O  0.172475 -0.038734 0.892144
O  -1.450785 4.584781 0.460671
N  -4.646991 -1.554779 0.12529
C  2.034484 -1.043219 -1.42084
C  2.095078 -1.997565 -0.280594
C  0.742636 -1.59798 -0.831004
C  2.442428 0.390568 -1.185454
C  2.357948 -1.538414 -2.809361
C  2.555917 -3.394516 -0.44011
C  -0.152723 -0.78454 0.003946
C  1.994265 -4.417108 0.188403
C  -2.420619 -0.206116 0.336704
C  -2.537069 1.172854 -0.264275
C  -3.663922 -0.966936 0.202498
C  -1.978586 2.246544 0.412262
C  -3.128335 1.356262 -1.510544
C  -1.990003 3.503693 -0.177168
C  -3.162248 2.622941 -2.069639
C  -2.583231 3.700742 -1.413956
C  -0.178998 4.497929 0.960963
C  0.095174 5.230348 2.107899
C  0.81935 3.7574 0.337353
C  1.379824 5.223103 2.631486
C  2.097927 3.755754 0.877214
C  2.386112 4.48492 2.02295
H  2.335789 -1.552861 0.682345
H  0.240709 -2.331212 -1.451812
H  1.867529 1.071949 -1.815755
H  3.495284 0.512497 -1.447212
H  2.327998 0.703411 -0.150415
H  2.004032 -2.554439 -2.987936
H  3.436131 -1.524162 -2.9809
H  1.896627 -0.893731 -3.559539
H  3.408388 -3.594973 -1.07934
H  -2.194305 -0.140308 1.405246
H  -1.53108 2.103029 1.388108
H  -3.566675 0.521531 -2.044286
H  -3.629273 2.773029 -3.034098
H  -2.592217 4.687621 -1.859136
H  -0.692117 5.802686 2.583028
H  0.616091 3.191406 -0.56337
H  1.590248 5.794768 3.526333
H  2.874912 3.181228 0.388362
H  3.385741 4.478913 2.437189
elementType: Cl O N C H
totalener: -2050.68381021 hartree
nucrepener: 2811.18790108 hartree
electener: -4861.87171129 hartree
oneelecener: -8397.86794581 hartree
twoeener: 3535.99623452 hartree
cpcmener: -0.03000116 hartree
kineticenergy: 2044.47790983 hartree
xcener: -151.863326904040 hartree
chargesum: 0.0000000
charge: -0.050032 -0.054270 -0.273013 -0.447663 -0.331106 -0.087150 0.155149 -0.039027 -0.145595 -0.293166 -0.282384 -0.215102 0.414300 0.073417 0.406091 -0.011581 -0.224747 -0.149537 -0.195961 0.229369 -0.136946 -0.202688 0.278713 -0.243057 -0.188602 -0.123583 -0.152563 -0.188044 0.116827 0.112676 0.105911 0.101070 0.086204 0.095478 0.102132 0.100264 0.140652 0.136164 0.145821 0.143411 0.160065 0.148867 0.144999 0.159128 0.156999 0.165058 0.157054
qa: -0.0500 -0.0543 -0.2730 -0.4477 -0.3311 -0.0872 0.1551 -0.0390 -0.1456 -0.2932 -0.2824 -0.2151 0.4143 0.0734 0.4061 -0.0116 -0.2247 -0.1495 -0.1960 0.2294 -0.1369 -0.2027 0.2787 -0.2431 -0.1886 -0.1236 -0.1526 -0.1880 0.1168 0.1127 0.1059 0.1011 0.0862 0.0955 0.1021 0.1003 0.1407 0.1362 0.1458 0.1434 0.1601 0.1489 0.1450 0.1591 0.1570 0.1651 0.1571
va: 1.2811 1.2522 2.1294 2.0595 2.0768 3.1122 3.7004 3.8796 3.8549 3.8982 3.9148 3.9017 4.1355 4.1895 3.7388 3.6268 4.0618 3.9221 3.9835 3.7702 3.9128 4.0203 3.7144 3.9988 3.8741 3.8960 3.8893 3.9257 1.0199 1.0245 0.9950 1.0031 1.0133 0.9996 0.9996 1.0029 1.0081 1.0172 1.0173 1.0081 0.9898 1.0034 1.0084 0.9934 0.9886 0.9867 0.9913
dispcorr: -0.026388580 hartree
energy: -2050.710198786105
dipole: 9.58254 -7.45016 2.13237 34.46738 -33.46610 1.00128 -12.48595 11.21785 -1.26810
magnitude: 2.67538 au
magnitude: 6.80028 debye
