program: Gaussian 09
title: 000074465
version: EM64L-G09RevD.01
frameworkgroup: C1[X(C12H16O2)]
method: RPBEPBE
basis: SDD
operation: Freq
keyword: #pfreq=noraman
keyword: PBEPBE/SDD
title: #p freq=noraman PBEPBE/SDD
converged: YES YES NO NO
title: Mulliken charges:
elementType: O O C C C C C C C C C C C C H H H H H H H H H H H H H H H H
charge: -0.272029 -0.249828 0.011229 0.365140 0.390141 0.498429 -0.617881 -0.619233 -0.810668 -0.808844 0.121952 -0.814377 -0.218521 -0.675660 0.238847 0.236859 0.263779 0.228260 0.217403 0.225518 0.218911 0.255654 0.237133 0.225881 0.226722 0.229175 0.227130 0.211559 0.226263 0.231055
chargesum: 0.00000
title: Mulliken charges with hydrogens summed into heavy atoms:
elementType: O O C C C C C C C C C C C C
charge: -0.272029 -0.249828 0.011229 0.365140 0.390141 0.498429 -0.379034 -0.382373 -0.101225 -0.108762 0.121952 -0.124641 0.237784 -0.006782
polarizability: 1.90744594e+02 -2.79279898e+00 1.45922178e+02 7.35230933e+00 1.69663859e+00 8.47234985e+01
1716.lowfreq: -16.9491 -4.7295 -0.0007 -0.0005 0.0006 7.2286 11.7637 29.5694 56.2592
frequency: -14.9975 29.3027 56.2399 66.9410 93.0574 135.3991 150.5231 161.6243 179.6189 220.5555 225.3445 255.1853 263.9971 286.6743 292.0305 340.5591 358.9887 420.2270 506.3805 528.4885 530.3769 555.6123 569.1229 599.7034 694.3049 770.3867 789.8654 797.9926 831.5135 869.3743 899.3070 938.8872 958.6155 1014.8918 1017.8366 1023.7447 1036.3365 1043.5584 1047.5547 1049.9494 1053.2244 1111.5883 1132.8956 1172.3595 1231.6969 1244.5187 1261.4973 1313.0840 1351.7008 1359.8933 1396.2362 1398.8819 1400.7161 1403.6622 1415.4485 1438.3774 1460.7441 1462.9287 1465.0102 1471.2935 1473.1241 1473.6301 1479.1776 1486.5396 1489.0430 1573.2774 1605.1493 1618.5854 2975.4051 2990.6051 2991.2309 2994.3369 3008.0261 3057.0665 3065.3565 3074.4429 3077.8199 3086.5337 3089.5796 3090.6018 3093.1218 3105.5849 3117.4036 3121.4736
redmass: 1.0162 3.1225 2.9774 4.9827 2.4873 3.0611 1.1293 1.1052 2.2669 2.6851 1.7673 2.1481 3.5809 2.9198 4.0223 3.0039 4.5091 3.9648 3.3652 3.9173 3.4852 4.3939 3.8373 4.2740 4.3999 4.4657 6.3590 1.1128 3.8106 1.2952 1.3046 2.4311 3.4562 2.4040 1.6713 1.6435 4.2486 1.5617 1.5443 1.7891 1.8046 2.2337 1.4565 2.0871 2.3327 1.1423 1.4873 6.5903 1.4166 6.7156 1.2322 1.2732 1.3664 1.2357 1.9667 1.8968 1.0685 1.0486 1.0927 1.0992 1.0602 1.0610 1.1710 1.0714 1.3938 7.3483 10.0337 5.8109 1.0388 1.0368 1.0364 1.0358 1.0582 1.0947 1.1063 1.0965 1.0973 1.0999 1.1000 1.0986 1.1004 1.1024 1.0910 1.0919
irintensity: 0.3860 0.7068 0.4452 1.6726 1.2801 5.0054 1.1925 0.9971 1.9272 0.1295 1.0775 2.2120 2.8256 2.9365 2.7849 3.8684 9.8950 0.5731 0.8267 0.9075 1.1522 1.7361 0.5699 1.2985 16.2481 2.4258 4.9250 3.0940 1.5841 19.4925 0.1163 0.7645 3.0752 9.5108 1.6781 1.0013 278.0141 10.9897 0.4584 40.4649 49.3296 3.6046 5.5570 103.0502 169.7604 0.0426 27.4750 4.3658 0.4216 2.4090 14.8474 32.3445 12.5333 9.7749 8.7678 40.0871 22.9361 7.6642 3.2157 13.4298 8.8009 5.0577 42.6507 16.2754 6.9789 30.5578 209.7387 72.0066 32.9546 41.1593 7.8889 22.9865 21.9964 21.7374 7.5197 17.1775 16.8254 15.5605 36.2887 20.8752 16.6284 42.9513 28.8820 16.1519
temp: 298.150 k
press: 1.00000 atm
elementType: 8 8 6 6 6 6 6 6 6 6 6 6 6 6 1 1 1 1 1 1 1 1 1 1 1 1 1 1 1 1
symmnumber: 1
zpe: 653717.0 jmol-1
zpe.correction: 0.248988 hartree
zpe.thermalcorrener: 0.263756 hartree
zpe.thermalcorrenthalpy: 0.264701 hartree
zpe.thermalcorrgfe: 0.206776 hartree
zpe.sumelectzpe: -616.285148 hartree
zpe.sumelectthermal: -616.270379 hartree
zpe.sumelectthermalent: -616.269435 hartree
zpe.sumelectthermalfe: -616.327359 hartree
dipole: 0.1319 -1.6387 1.0793
dipole: 1.9666
quadrupole: -67.6108 -82.3234 -87.5301
quadrupole: 2.8892 -0.7742 4.4603
quadrupole: 11.5440 -3.1686 -8.3754 2.8892 -0.7742 4.4603
hfenergy: -616.5341352 hartree
pointgroup: C01 [X(C12H16O2)]
dipole: -0.1080493 0.4554032 0.6161057 debye
polarizability: 190.8505092|3.6662564|140.2451934|-6.5662356|17.6843012|90.2945681 unknown
InChI: InChI=1S/C12H16O2/c1-5-14-12(13)11-9(3)6-8(2)7-10(11)4/h6-7H,5H2,1-4H3
charge 0 multiplicity 1
30 atoms
O  2.20328 0.225887 0.451428
O  1.872282 -1.198727 -1.35034
C  -0.074893 -0.278056 -0.169365
C  -0.941371 -1.413156 -0.294403
C  -0.611819 1.00623 0.166528
C  -2.878565 0.012609 0.290465
C  -2.323716 -1.243282 -0.050523
C  -2.005976 1.12232 0.379569
C  -0.432674 -2.796112 -0.66588
C  0.235138 2.265106 0.271451
C  1.383086 -0.472859 -0.446159
C  -4.363465 0.160896 0.567717
C  3.675286 0.081617 0.230437
C  4.365532 0.894325 1.321455
H  -2.983153 -2.116055 -0.134004
H  -2.419931 2.109709 0.619437
H  -0.056599 -2.81523 -1.703117
H  0.41413 -3.111658 -0.029772
H  -1.238583 -3.542688 -0.563968
H  0.915179 2.380727 -0.591116
H  -0.411539 3.157984 0.321324
H  0.872611 2.240636 1.171824
H  -4.587165 -0.033529 1.634993
H  -4.719107 1.180766 0.338932
H  -4.960179 -0.553386 -0.026449
H  3.930017 -0.992752 0.275905
H  3.913774 0.444174 -0.786169
H  5.462454 0.815586 1.209454
H  4.086462 1.960242 1.25794
H  4.091005 0.521675 2.323105
