program: Orca
programVersion: 5.0.2
elementType: Cl Cl O O O N C C C C C C C C C C C C C C C C C C C C C C H H H H H H H H H H H H H H H H H H H
charge: 0
multiplicity: 1
keywords: wb97x-d3
keywords: def2-TZVPP
keywords: def2/J RIJCOSX
keywords: DEFGRID2
keywords: scfconv7
keywords: smallprint printgap noloewdin
keywords: NOSOSCF
formula: C22H19Cl2NO3
InChI: InChI=1/C22H19Cl2NO3/c1-22(2)17(12-19(23)24)20(22)21(26)28-18(13-25)14-7-6-10-16(11-14)27-15-8-4-3-5-9-15/h3-12,17-18,20H,1-2H3
47 atoms
Cl 3.133632 -5.167189 1.303563
Cl 2.157027 -7.31211 -0.359355
O  -1.628517 -1.216921 -0.423803
O  0.19775 -1.008863 0.844628
O  -0.68224 4.252456 1.566402
N  -4.769104 -0.220087 -0.307905
C  1.461878 -2.339839 -1.73827
C  1.430515 -3.306833 -0.588844
C  0.167947 -2.567076 -0.97858
C  2.244188 -1.06233 -1.556904
C  1.491579 -2.851062 -3.157769
C  1.480022 -4.759763 -0.790959
C  -0.370261 -1.535306 -0.076049
C  2.166032 -5.617519 -0.046914
C  -2.227385 -0.145071 0.289228
C  -1.651313 1.198358 -0.09986
C  -3.649806 -0.205343 -0.053536
C  -1.428293 2.146535 0.885205
C  -1.373222 1.482989 -1.431801
C  -0.916349 3.390693 0.538706
C  -0.848158 2.722539 -1.759639
C  -0.61103 3.681261 -0.785023
C  -0.731221 5.607624 1.369022
C  -1.778077 6.21398 0.685079
C  0.278197 6.367639 1.941383
C  -1.797092 7.596044 0.566956
C  0.238623 7.750341 1.827024
C  -0.7928 8.369373 1.134818
H  1.906659 -2.942085 0.313998
H  -0.583378 -3.132412 -1.519089
H  1.795639 -0.246194 -2.126297
H  3.259449 -1.202692 -1.930197
H  2.323725 -0.745718 -0.519902
H  2.509528 -3.12282 -3.442729
H  1.15337 -2.072133 -3.843231
H  0.855939 -3.721044 -3.316624
H  0.90599 -5.177528 -1.609652
H  -2.146166 -0.294701 1.370874
H  -1.644583 1.924304 1.923798
H  -1.556581 0.751828 -2.208752
H  -0.615414 2.950434 -2.791374
H  -0.189203 4.638001 -1.064695
H  -2.574122 5.621854 0.250266
H  1.083935 5.880161 2.476623
H  -2.610041 8.069721 0.031778
H  1.024722 8.343265 2.277054
H  -0.817158 9.44717 1.041432
elementType: Cl O N C H
totalener: -2050.68656000 hartree
nucrepener: 2651.67663678 hartree
electener: -4702.36319678 hartree
oneelecener: -8078.72319935 hartree
twoeener: 3376.36000257 hartree
cpcmener: -0.03195989 hartree
kineticenergy: 2044.47260675 hartree
xcener: -151.864047675979 hartree
chargesum: -0.0000000
charge: -0.054428 -0.060122 -0.279575 -0.432308 -0.323567 -0.086226 0.090585 0.029918 -0.067670 -0.263676 -0.263508 -0.203974 0.361696 0.041459 0.400862 0.041107 -0.225717 -0.243027 -0.233552 0.279732 -0.136315 -0.181427 0.280622 -0.195855 -0.242430 -0.142071 -0.124075 -0.180572 0.079736 0.099630 0.095108 0.101501 0.096557 0.101681 0.098360 0.090992 0.130128 0.142011 0.133331 0.147180 0.159682 0.157511 0.158582 0.146154 0.159275 0.158275 0.158418
qa: -0.0544 -0.0601 -0.2796 -0.4323 -0.3236 -0.0862 0.0906 0.0299 -0.0677 -0.2637 -0.2635 -0.2040 0.3617 0.0415 0.4009 0.0411 -0.2257 -0.2430 -0.2336 0.2797 -0.1363 -0.1814 0.2806 -0.1959 -0.2424 -0.1421 -0.1241 -0.1806 0.0797 0.0996 0.0951 0.1015 0.0966 0.1017 0.0984 0.0910 0.1301 0.1420 0.1333 0.1472 0.1597 0.1575 0.1586 0.1462 0.1593 0.1583 0.1584
va: 1.2709 1.2444 2.1220 2.0798 2.0823 3.1132 3.7394 3.8822 3.8238 3.9031 3.9057 3.8986 4.2352 4.2121 3.7213 3.6128 4.0765 4.0925 3.9623 3.7597 3.9136 3.9117 3.6866 3.9210 4.0111 3.8886 3.8852 3.9034 1.0491 1.0319 1.0016 1.0012 1.0168 1.0010 1.0017 1.0057 1.0184 1.0181 1.0190 1.0132 0.9909 0.9958 0.9958 1.0078 0.9902 0.9891 0.9903
dispcorr: -0.023373574 hartree
energy: -2050.709933574749
dipole: -3.48952 4.57772 1.08819 40.27424 -39.12532 1.14891 -15.02525 13.49867 -1.52659
magnitude: 2.19878 au
magnitude: 5.58886 debye
