program: Orca
programVersion: 5.0.2
elementType: Cl Cl O O O N C C C C C C C C C C C C C C C C C C C C C C H H H H H H H H H H H H H H H H H H H
charge: 0
multiplicity: 1
keywords: wb97x-d3
keywords: def2-TZVPP
keywords: def2/J RIJCOSX
keywords: DEFGRID2
keywords: scfconv7
keywords: smallprint printgap noloewdin
keywords: NOSOSCF
formula: C22H19Cl2NO3
InChI: InChI=1/C22H19Cl2NO3/c1-22(2)17(12-19(23)24)20(22)21(26)28-18(13-25)14-7-6-10-16(11-14)27-15-8-4-3-5-9-15/h3-12,17-18,20H,1-2H3
47 atoms
Cl 3.200873 -5.083179 1.289103
Cl 2.147734 -7.307155 -0.215246
O  -1.530654 -1.235131 -0.182467
O  0.475647 -0.900064 0.738849
O  -0.538444 4.354233 1.460901
N  -4.643813 -0.324721 0.433213
C  1.383865 -2.414465 -1.87827
C  1.492882 -3.310653 -0.679406
C  0.192872 -2.577904 -0.951354
C  2.185984 -1.135867 -1.874756
C  1.228053 -3.007493 -3.257531
C  1.507234 -4.773603 -0.790552
C  -0.220679 -1.49991 -0.037851
C  2.189897 -5.597681 -0.005982
C  -2.041396 -0.157593 0.587568
C  -1.596747 1.191655 0.068856
C  -3.498128 -0.272325 0.490065
C  -1.267141 2.1848 0.976785
C  -1.554568 1.440009 -1.297785
C  -0.887731 3.43845 0.515301
C  -1.156911 2.69082 -1.742988
C  -0.819106 3.695478 -0.848084
C  -0.760618 5.689447 1.247522
C  0.259914 6.565842 1.583583
C  -1.978984 6.16296 0.776456
C  0.057626 7.932117 1.446585
C  -2.162077 7.530253 0.632533
C  -1.148906 8.419644 0.965679
H  2.075096 -2.897788 0.136345
H  -0.623298 -3.165981 -1.355658
H  3.126538 -1.29685 -2.40417
H  2.433415 -0.784104 -0.875955
H  1.649378 -0.338458 -2.392646
H  0.560869 -3.868322 -3.28492
H  2.197359 -3.321181 -3.649561
H  0.821156 -2.26096 -3.941833
H  0.907112 -5.230811 -1.568102
H  -1.773717 -0.265383 1.644281
H  -1.30045 1.990557 2.042438
H  -1.822046 0.673096 -2.013226
H  -1.106537 2.891377 -2.805031
H  -0.503467 4.662461 -1.218112
H  1.201261 6.180971 1.954833
H  -2.780462 5.478774 0.527171
H  0.853351 8.615752 1.712248
H  -3.109459 7.900546 0.2631
H  -1.300864 9.48507 0.853531
elementType: Cl O N C H
totalener: -2050.68667214 hartree
nucrepener: 2648.94027864 hartree
electener: -4699.62695079 hartree
oneelecener: -8073.29289555 hartree
twoeener: 3373.66594477 hartree
cpcmener: -0.03208137 hartree
kineticenergy: 2044.47799703 hartree
xcener: -151.864895815587 hartree
chargesum: 0.0000000
charge: -0.054648 -0.059838 -0.281867 -0.435114 -0.325144 -0.087132 0.088207 0.026971 -0.062022 -0.263373 -0.270161 -0.203492 0.368610 0.043747 0.404128 0.034940 -0.225405 -0.237173 -0.226019 0.263443 -0.141123 -0.169816 0.268008 -0.238379 -0.184034 -0.125287 -0.145518 -0.178593 0.080270 0.099361 0.100011 0.096682 0.096690 0.092177 0.102598 0.098954 0.129014 0.142410 0.134159 0.146996 0.160138 0.157178 0.145946 0.158686 0.157833 0.158799 0.158184
qa: -0.0546 -0.0598 -0.2819 -0.4351 -0.3251 -0.0871 0.0882 0.0270 -0.0620 -0.2634 -0.2702 -0.2035 0.3686 0.0437 0.4041 0.0349 -0.2254 -0.2372 -0.2260 0.2634 -0.1411 -0.1698 0.2680 -0.2384 -0.1840 -0.1253 -0.1455 -0.1786 0.0803 0.0994 0.1000 0.0967 0.0967 0.0922 0.1026 0.0990 0.1290 0.1424 0.1342 0.1470 0.1601 0.1572 0.1459 0.1587 0.1578 0.1588 0.1582
va: 1.2708 1.2448 2.1228 2.0777 2.0776 3.1131 3.7393 3.8807 3.8188 3.9043 3.9093 3.9034 4.2213 4.2139 3.7187 3.6163 4.0776 4.0899 3.9610 3.7694 3.9173 3.9075 3.6973 4.0065 3.9129 3.8861 3.8913 3.8998 1.0489 1.0317 1.0010 1.0167 1.0007 1.0057 1.0003 1.0011 1.0198 1.0182 1.0186 1.0133 0.9909 0.9958 1.0076 0.9958 0.9892 0.9905 0.9903
dispcorr: -0.023199662 hartree
energy: -2050.709871804560
dipole: -5.71998 6.56632 0.84634 39.48900 -38.44506 1.04394 -17.17264 15.39554 -1.77710
magnitude: 2.22805 au
magnitude: 5.66325 debye
