program: Gaussian 09
title: 000074511
version: EM64L-G09RevD.01
frameworkgroup: C1[X(C16H19ClN2O)]
method: RPBEPBE
basis: SDD
operation: Freq
keyword: #p
keyword: freq=noraman
keyword: PBEPBE/SDD
title: #p freq=noraman PBEPBE/SDD
converged: NO YES NO NO
title: Mulliken charges:
elementType: Cl O N N C C C C C C C C C C C C C C C C H H H H H H H H H H H H H H H H H H H
charge: -0.052138 -0.239063 -0.013536 -0.216961 -0.131467 -0.447477 -0.451995 -0.396839 -0.403185 -0.388120 0.051507 0.272202 0.249074 -0.592662 -0.326389 0.165680 -0.319005 -0.166641 -0.251943 -0.645153 0.221451 0.232512 0.194364 0.199626 0.235168 0.201973 0.190030 0.191196 0.202865 0.199910 0.195708 0.232298 0.269827 0.274331 0.251377 0.261447 0.231823 0.280976 0.237228
chargesum: 0.00000
title: Mulliken charges with hydrogens summed into heavy atoms:
elementType: Cl O N N C C C C C C C C C C C C C C C C
charge: -0.052138 -0.239063 -0.013536 -0.216961 0.089983 -0.020601 -0.017200 -0.004837 -0.009123 0.007497 0.051507 0.272202 0.249074 -0.090538 -0.052058 0.165680 -0.067628 -0.166641 0.009504 0.104874
polarizability: 2.18203778e+02 2.28581623e+00 2.51837423e+02 1.32328962e+01 3.68368241e+00 1.33108194e+02
1716.lowfreq: -11.7645 -0.0005 0.0009 0.0015 1.8026 6.9554 13.2499 50.4020 62.8005
frequency: 9.0851 50.2728 62.7959 70.1476 97.5531 123.8381 135.3070 160.7961 173.3778 209.3147 229.7579 232.2928 234.8215 282.5382 300.9663 323.9200 334.6953 371.7675 381.8253 406.0737 421.8479 431.5213 457.0676 478.1342 494.7224 502.6047 533.2416 565.0318 611.2432 664.1534 684.0887 695.6591 747.7302 762.6065 778.9126 790.9429 813.9098 820.1441 855.4700 872.7424 890.0155 890.7566 902.2224 923.2780 950.0730 957.5586 970.3993 986.1979 1045.9076 1047.7145 1052.4249 1070.0981 1090.2085 1095.5379 1112.5255 1117.8316 1124.5433 1139.7451 1147.4378 1175.7684 1199.7982 1215.6955 1247.5786 1255.1924 1258.2964 1263.9436 1278.3875 1304.6690 1309.0665 1310.6548 1318.8563 1329.7408 1335.9450 1341.5707 1343.0194 1354.3910 1372.5688 1386.2601 1425.0597 1460.1479 1463.8893 1465.1140 1465.6522 1467.3939 1469.3184 1473.9206 1481.1384 1498.2937 1554.2027 1586.4520 1594.3994 1616.6767 2945.4926 2962.3821 2962.6944 2971.0896 2973.5933 2981.3948 2985.8050 2986.4301 3023.6183 3027.4403 3034.4518 3042.2370 3055.6245 3081.6112 3107.3150 3127.2024 3157.8320 3166.8621 3178.9361
redmass: 3.5105 4.4545 4.5697 6.0434 4.5671 4.5916 3.6110 1.3038 2.7409 4.5425 4.0413 2.1258 3.2126 6.0864 4.3636 5.2348 2.0872 3.8736 3.6993 4.5978 4.2157 3.1449 3.5991 5.1857 3.6454 1.6110 3.7753 4.3125 5.1076 5.3128 6.2886 5.7314 3.7206 4.9216 3.2571 1.4416 3.8496 1.5417 1.9182 1.7751 1.7310 1.5609 3.0488 1.7791 1.3432 2.3456 4.3238 2.5579 2.4510 2.1261 1.7182 1.2480 2.3920 2.5777 2.3698 1.3973 2.1752 2.0788 1.5470 1.4331 1.3106 1.8351 1.5880 1.3562 1.4343 1.4614 2.9448 1.3314 1.6149 1.5645 1.3144 1.5652 1.3682 1.5254 1.5093 1.4614 9.2547 3.7225 1.2053 1.1317 1.1218 1.0871 1.0863 1.1927 1.8076 1.0988 1.0919 1.0653 7.4568 8.3595 6.9024 8.3366 1.0686 1.0619 1.0625 1.0629 1.0627 1.0827 1.0623 1.0390 1.0980 1.0943 1.1027 1.1021 1.1014 1.0946 1.0933 1.1024 1.0880 1.0919 1.0972
irintensity: 0.3308 1.4459 1.7048 0.6405 3.3057 1.1728 0.2330 0.8336 0.3661 0.4744 1.4693 0.1900 1.5058 0.3100 7.7605 1.7137 0.5088 8.8449 1.4114 3.0765 3.5966 0.6461 3.1763 9.5095 2.0947 6.4467 13.2846 12.2753 3.2029 1.0745 0.8070 1.3063 17.4066 13.9822 29.9461 0.0574 18.9914 41.4385 7.7616 7.2323 1.0252 19.0022 4.5019 0.1170 0.3359 16.5689 11.7356 16.2278 6.7233 5.3211 0.6968 0.3054 26.4785 9.3592 0.1029 0.2344 60.6033 4.8458 1.1681 1.9721 14.7447 18.5590 17.4110 3.1580 15.7116 5.4112 49.0149 6.5790 25.1797 33.6493 1.7484 12.5175 0.3199 1.0265 0.8653 2.8277 6.2164 42.0390 28.4140 57.8948 16.6241 4.5402 5.6237 10.2713 124.3298 12.5247 2.4883 15.8668 16.8558 10.5581 25.4474 392.2643 30.3723 15.0165 48.9115 37.8018 47.1343 12.0326 26.0132 38.2363 70.1517 59.2096 21.5278 34.9052 69.5716 19.3746 12.8334 2.6309 3.6987 0.8998 4.0074
temp: 298.150 k
press: 1.00000 atm
elementType: 17 8 7 7 6 6 6 6 6 6 6 6 6 6 6 6 6 6 6 6 1 1 1 1 1 1 1 1 1 1 1 1 1 1 1 1 1 1 1
symmnumber: 1
zpe: 837879.2 jmol-1
zpe.correction: 0.319131 hartree
zpe.thermalcorrener: 0.337326 hartree
zpe.thermalcorrenthalpy: 0.338271 hartree
zpe.thermalcorrgfe: 0.271498 hartree
zpe.sumelectzpe: -1264.415986 hartree
zpe.sumelectthermal: -1264.397791 hartree
zpe.sumelectthermalent: -1264.396847 hartree
zpe.sumelectthermalfe: -1264.463620 hartree
dipole: 1.4360 2.2937 1.3695
dipole: 3.0330
quadrupole: -112.3911 -150.3282 -123.1477
quadrupole: -3.3989 3.7037 -3.6304
quadrupole: 16.2312 -21.7058 5.4746 -3.3989 3.7037 -3.6304
hfenergy: -1264.7351174 hartree
pointgroup: C01 [X(C16H19Cl1N2O1)]
dipole: 0.4567669 -0.9861973 -0.4925931 debye
polarizability: 218.4205024|1.2933655|252.1249764|-11.8065552|0.2473009|132.603916 unknown
InChI: InChI=1S/C16H19ClN2O/c1-19-14-8-7-12(17)9-13(14)16(18-10-15(19)20)11-5-3-2-4-6-11/h7-9,11H,2-6,10H2,1H3
charge 0 multiplicity 1
39 atoms
Cl 1.513331 -4.553763 0.335307
O  1.948041 3.678507 0.256077
N  -0.553523 1.479948 0.994951
N  2.156993 1.446252 -0.395213
C  -1.884884 -0.196621 -0.15125
C  -2.854409 -0.529749 1.02245
C  -2.537311 0.847351 -1.103674
C  -4.228329 -1.014731 0.505094
C  -3.911455 0.360835 -1.618356
C  -4.867238 0.020691 -0.450201
C  -0.541124 0.320737 0.375612
C  0.685857 -0.513187 0.18033
C  1.962566 0.047224 -0.166167
C  0.716694 1.993221 1.560261
C  0.575063 -1.925561 0.318096
C  1.650179 2.466934 0.442129
C  3.065897 -0.827291 -0.379302
C  1.688875 -2.752133 0.1257
C  2.943853 -2.219954 -0.232816
C  3.096995 1.874035 -1.459669
H  -1.711081 -1.122062 -0.736643
H  -2.976131 0.387511 1.630433
H  -2.404736 -1.296209 1.686084
H  -1.859522 1.050813 -1.955976
H  -2.647214 1.796061 -0.545428
H  -4.900702 -1.214041 1.362035
H  -4.101995 -1.977497 -0.03341
H  -3.77257 -0.541492 -2.250346
H  -4.361351 1.137298 -2.267154
H  -5.829615 -0.362397 -0.841657
H  -5.094088 0.947304 0.115979
H  1.242052 1.2244 2.168237
H  0.497436 2.86739 2.190091
H  -0.389494 -2.365858 0.585508
H  4.04016 -0.410467 -0.650047
H  3.805685 -2.87499 -0.387408
H  4.146463 1.87953 -1.109532
H  2.835621 2.905647 -1.740819
H  2.999711 1.204615 -2.329005
