program: Gaussian 09
title: 000074448
version: EM64L-G09RevD.01
frameworkgroup: C1[X(C18H22)]
method: RPBEPBE
basis: SDD
operation: Freq
keyword: #p
keyword: freq=noraman
keyword: PBEPBE/SDD
title: #p freq=noraman PBEPBE/SDD
converged: YES YES NO NO
title: Mulliken charges:
elementType: C C C C C C C C C C C C C C C C C C H H H H H H H H H H H H H H H H H H H H H H
charge: -0.383043 0.487966 0.564110 -0.748405 -0.599095 -0.587044 -0.439032 -0.492507 0.333642 0.341912 0.323968 0.315838 -0.438839 -0.421884 -0.821295 -0.822197 -0.812551 -0.811166 0.217113 0.219355 0.220230 0.232761 0.240829 0.248560 0.243770 0.230415 0.224790 0.226062 0.232158 0.223717 0.222226 0.232821 0.223117 0.222470 0.223759 0.223542 0.227796 0.223613 0.223570 0.226950
chargesum: 0.00000
title: Mulliken charges with hydrogens summed into heavy atoms:
elementType: C C C C C C C C C C C C C C C C C C
charge: -0.165930 0.487966 0.564110 -0.076059 -0.358266 -0.338484 -0.195262 -0.262093 0.333642 0.341912 0.323968 0.315838 -0.214049 -0.195822 -0.143195 -0.143788 -0.137453 -0.137034
polarizability: 2.37610446e+02 1.50342750e-01 1.73178201e+02 -1.85635713e+01 -4.29229297e-01 1.69093084e+02
1716.lowfreq: -10.5153 -3.8495 0.0002 0.0005 0.0006 6.4318 14.2317 22.3131 38.3243
frequency: 13.8950 21.9645 38.2738 95.6365 101.0542 113.9090 130.8939 147.2837 155.6859 158.3487 191.9808 201.9303 235.6910 253.5467 282.5033 287.4050 289.8026 316.2416 320.7791 388.4535 416.1254 438.8168 442.5346 459.1502 492.9471 524.8882 545.0808 564.7333 602.3842 616.8329 688.6987 731.9679 733.1659 739.0254 743.4077 747.9092 829.4055 834.8808 891.0024 902.5582 905.0044 917.1930 949.7120 953.3801 981.1251 990.4782 992.3265 994.7644 1021.2095 1029.6149 1030.7812 1050.5952 1052.8612 1053.2359 1078.2760 1129.6067 1134.0939 1154.7778 1176.4113 1209.4461 1220.7206 1246.6052 1250.8166 1265.2695 1293.3186 1299.5785 1305.2930 1369.4737 1375.5275 1384.6504 1391.7279 1392.6493 1402.5221 1404.2359 1408.8903 1413.7444 1460.6113 1462.0743 1468.6608 1469.0436 1473.5213 1473.9139 1475.0313 1476.8946 1477.4663 1483.4023 1498.3868 1501.4666 1581.7357 1586.8325 1622.6129 1625.5014 2963.7073 2965.7297 2966.0946 2966.7656 2967.9318 2978.8392 3036.1549 3036.6653 3040.2941 3040.3476 3075.1568 3078.6447 3078.7856 3082.0992 3083.2885 3084.0764 3105.3830 3108.3970 3113.7172 3114.7954 3130.6377 3151.0317
redmass: 3.4143 3.2417 3.8916 1.7863 1.4074 1.1430 2.2044 1.4666 1.1793 1.7786 2.9559 2.8369 3.4126 2.9198 1.1836 2.3993 2.3814 3.1349 3.3529 3.1869 3.0356 2.7819 2.8853 3.2215 4.1397 3.7540 4.0346 4.1303 3.0853 4.1971 3.4825 2.7063 3.4342 4.2786 3.4033 2.7956 1.3396 1.4121 3.2808 1.4268 1.4010 2.8384 1.3582 1.3390 1.5595 1.6412 1.5511 1.4652 1.6777 1.4519 1.4557 1.5840 1.6486 1.6458 2.4649 2.0611 2.3329 1.6953 1.4848 1.8115 1.8063 1.9659 3.0261 1.7548 1.4380 1.4885 1.8330 5.0343 4.6660 1.2322 1.2405 1.2416 1.4731 1.2878 2.0151 2.3870 1.0477 1.0476 1.1803 1.1847 1.0481 1.0503 1.0465 1.2022 1.1687 1.0793 2.2693 2.3640 6.2905 6.1837 6.4035 6.3903 1.0824 1.0375 1.0375 1.0383 1.0382 1.0353 1.0969 1.0969 1.0968 1.0968 1.1001 1.0985 1.0985 1.0994 1.0976 1.0976 1.0868 1.0907 1.0887 1.0907 1.0966 1.0944
irintensity: 0.0808 0.0124 0.2570 1.5644 0.3076 0.0578 1.0543 0.4301 0.6493 0.6026 0.6410 1.2700 1.8656 0.8529 0.2347 0.0189 0.0657 1.2792 1.3222 0.3257 0.8321 7.5131 2.1423 3.7473 0.6860 0.6008 1.8406 1.6716 8.9146 2.5062 1.4361 4.6715 3.6063 0.4056 1.3379 5.5926 28.5973 21.3387 1.1853 9.0387 6.1264 7.6270 0.6271 1.0690 7.1891 5.5646 8.3393 20.2949 0.9477 15.6649 14.7501 7.2707 0.2357 0.2089 5.0863 7.3837 12.1751 5.1558 4.3852 0.0020 0.4830 1.3665 0.9615 3.5649 1.8510 3.0260 6.6866 1.3193 0.6013 13.3792 6.1723 5.0858 16.6857 19.1813 1.6506 0.6568 0.0463 0.2268 43.0028 4.9204 16.9670 24.6538 29.2797 1.6920 0.9726 3.5084 43.5773 31.2602 7.6425 0.6326 7.6390 4.0113 20.9714 78.1727 52.3781 12.6462 24.9284 27.1509 45.3381 45.4009 0.4879 1.5271 42.5181 27.4089 31.1951 34.8768 13.0598 13.8530 16.3322 20.6204 21.0417 15.5526 27.0148 17.4105
temp: 298.150 k
press: 1.00000 atm
elementType: 6 6 6 6 6 6 6 6 6 6 6 6 6 6 6 6 6 6 1 1 1 1 1 1 1 1 1 1 1 1 1 1 1 1 1 1 1 1 1 1
symmnumber: 1
zpe: 898553.5 jmol-1
zpe.correction: 0.342241 hartree
zpe.thermalcorrener: 0.361025 hartree
zpe.thermalcorrenthalpy: 0.361969 hartree
zpe.thermalcorrgfe: 0.293972 hartree
zpe.sumelectzpe: -697.818422 hartree
zpe.sumelectthermal: -697.799638 hartree
zpe.sumelectthermalent: -697.798694 hartree
zpe.sumelectthermalfe: -697.866691 hartree
dipole: 0.0246 -0.8062 0.1300
dipole: 0.8169
quadrupole: -100.5810 -106.0464 -104.2359
quadrupole: 0.3894 -1.6147 -0.3599
quadrupole: 3.0401 -2.4253 -0.6148 0.3894 -1.6147 -0.3599
hfenergy: -698.1606629 hartree
pointgroup: C01 [X(C18H22)]
dipole: -0.0086644 -0.3091461 0.0875171 debye
polarizability: 235.2860585|-8.8031408|172.9957994|-20.5216505|-0.5706172|171.5998733 unknown
InChI: InChI=1S/C18H22/c1-12-6-8-17(10-14(12)3)16(5)18-9-7-13(2)15(4)11-18/h6-11,16H,1-5H3
charge 0 multiplicity 1
40 atoms
C  0.002371 1.826509 -0.353572
C  1.276884 0.967132 -0.389288
C  -1.242307 1.008001 0.026356
C  -0.265062 2.608901 -1.665979
C  1.723066 0.347307 0.807828
C  -1.531097 -0.226076 -0.608587
C  2.041125 0.760858 -1.560664
C  -2.162987 1.497597 0.981681
C  2.886598 -0.452147 0.863308
C  -2.702019 -0.964869 -0.319402
C  3.649643 -0.653814 -0.329745
C  -3.62819 -0.458397 0.645135
C  3.20695 -0.039471 -1.523629
C  -3.336901 0.770838 1.28293
C  3.317241 -1.086274 2.174635
C  -2.966293 -2.283709 -1.025092
C  4.907064 -1.505201 -0.319739
C  -4.896596 -1.22145 0.985207
H  0.142206 2.582391 0.447767
H  -0.461236 1.922726 -2.510119
H  0.591944 3.255154 -1.931275
H  -1.157196 3.248369 -1.546586
H  1.134888 0.48897 1.724347
H  -0.815546 -0.629444 -1.336481
H  1.741281 1.222826 -2.506846
H  -1.963289 2.448861 1.491605
H  3.787342 -0.18703 -2.44311
H  -4.040125 1.163172 2.028059
H  2.627734 -0.818644 2.993185
H  3.343986 -2.191224 2.104478
H  4.334805 -0.763588 2.469119
H  -2.15346 -2.530237 -1.729077
H  -3.055281 -3.120652 -0.305315
H  -3.913971 -2.257339 -1.597618
H  5.666397 -1.105553 0.380386
H  4.695611 -2.543443 0.002191
H  5.364582 -1.550297 -1.322839
H  -5.537607 -1.366051 0.093801
H  -4.673139 -2.231255 1.38118
H  -5.491917 -0.686146 1.744665
