program: Orca
programVersion: 5.0.2
elementType: Cl Cl O O O N C C C C C C C C C C C C C C C C C C C C C C H H H H H H H H H H H H H H H H H H H
charge: 0
multiplicity: 1
keywords: wb97x-d3
keywords: def2-TZVPP
keywords: def2/J RIJCOSX
keywords: DEFGRID2
keywords: scfconv7
keywords: smallprint printgap noloewdin
keywords: NOSOSCF
formula: C22H19Cl2NO3
InChI: InChI=1/C22H19Cl2NO3/c1-22(2)17(12-19(23)24)20(22)21(26)28-18(13-25)14-7-6-10-16(11-14)27-15-8-4-3-5-9-15/h3-12,17-18,20H,1-2H3
47 atoms
Cl 4.447581 -3.69541 -0.439786
Cl 3.457519 -6.399045 -0.260302
O  -1.306476 -1.173238 0.692171
O  0.665905 -0.302394 0.105818
O  -1.402396 4.602369 -0.559604
N  -3.663117 -0.495019 2.888293
C  0.42551 -2.572193 -2.081837
C  1.44651 -2.939692 -1.044398
C  0.060565 -2.509468 -0.609719
C  0.655141 -1.306219 -2.869878
C  -0.263895 -3.648744 -2.883992
C  1.849305 -4.330295 -0.802891
C  -0.111983 -1.220197 0.079118
C  3.083026 -4.740149 -0.536731
C  -1.652666 0.057727 1.313355
C  -2.070071 1.106505 0.308268
C  -2.775716 -0.268426 2.195363
C  -1.511506 2.374268 0.375327
C  -3.011446 0.792034 -0.66489
C  -1.926211 3.346375 -0.528187
C  -3.397025 1.76573 -1.57184
C  -2.867664 3.044839 -1.502945
C  -0.962472 5.224418 0.577736
C  0.202189 5.971142 0.470467
C  -1.672064 5.182451 1.771862
C  0.660009 6.683448 1.569586
C  -1.193827 5.888563 2.866655
C  -0.030195 6.640516 2.772942
H  2.219788 -2.195081 -0.892829
H  -0.609059 -3.29303 -0.273174
H  1.24608 -0.565355 -2.33623
H  -0.293969 -0.845357 -3.150584
H  1.189404 -1.545084 -3.791066
H  -0.532788 -4.522768 -2.291944
H  0.373284 -3.982497 -3.705138
H  -1.185308 -3.257518 -3.31884
H  1.08045 -5.093359 -0.831299
H  -0.836858 0.428968 1.942346
H  -0.760845 2.592885 1.124947
H  -3.446383 -0.198235 -0.717686
H  -4.128738 1.533094 -2.334097
H  -3.178598 3.808895 -2.204302
H  0.739036 6.000087 -0.469541
H  -2.588941 4.612203 1.854596
H  1.565116 7.27052 1.481728
H  -1.74302 5.852708 3.798693
H  0.333174 7.191581 3.630347
elementType: Cl O N C H
totalener: -2050.68669170 hartree
nucrepener: 2683.03365009 hartree
electener: -4733.72034180 hartree
oneelecener: -8141.41241006 hartree
twoeener: 3407.69206827 hartree
cpcmener: -0.03146103 hartree
kineticenergy: 2044.47001912 hartree
xcener: -151.863300557640 hartree
chargesum: 0.0000000
charge: -0.054662 -0.060007 -0.278615 -0.437336 -0.323313 -0.087544 0.088614 0.032478 -0.072300 -0.264495 -0.265621 -0.203450 0.374675 0.041340 0.404663 0.022938 -0.226773 -0.195223 -0.235096 0.284986 -0.122294 -0.228835 0.299921 -0.254601 -0.211020 -0.115901 -0.135544 -0.189414 0.079873 0.099170 0.095798 0.097891 0.099849 0.091615 0.102609 0.098180 0.128996 0.139338 0.145479 0.147078 0.158518 0.148232 0.145921 0.158206 0.157949 0.159292 0.158437
qa: -0.0547 -0.0600 -0.2786 -0.4373 -0.3233 -0.0875 0.0886 0.0325 -0.0723 -0.2645 -0.2656 -0.2035 0.3747 0.0413 0.4047 0.0229 -0.2268 -0.1952 -0.2351 0.2850 -0.1223 -0.2288 0.2999 -0.2546 -0.2110 -0.1159 -0.1355 -0.1894 0.0799 0.0992 0.0958 0.0979 0.0998 0.0916 0.1026 0.0982 0.1290 0.1393 0.1455 0.1471 0.1585 0.1482 0.1459 0.1582 0.1579 0.1593 0.1584
va: 1.2709 1.2446 2.1289 2.0782 2.0897 3.1117 3.7428 3.8752 3.8320 3.9053 3.9063 3.8991 4.2211 4.2139 3.7328 3.5960 4.0787 3.9623 3.9708 3.7405 3.9139 4.0080 3.6793 4.0158 3.9255 3.8790 3.8842 3.9108 1.0486 1.0322 1.0176 1.0006 1.0005 1.0056 1.0007 1.0016 1.0189 1.0186 1.0082 1.0120 0.9895 1.0057 1.0086 0.9965 0.9891 0.9901 0.9905
dispcorr: -0.023310173 hartree
energy: -2050.710001878283
dipole: -20.73696 20.52943 -0.20753 26.75502 -26.53705 0.21797 -10.65457 9.31424 -1.34033
magnitude: 1.37370 au
magnitude: 3.49168 debye
