program: Orca
programVersion: 5.0.2
elementType: Cl Cl O O O N C C C C C C C C C C C C C C C C C C C C C C H H H H H H H H H H H H H H H H H H H
charge: 0
multiplicity: 1
keywords: wb97x-d3
keywords: def2-TZVPP
keywords: def2/J RIJCOSX
keywords: DEFGRID2
keywords: scfconv7
keywords: smallprint printgap noloewdin
keywords: NOSOSCF
formula: C22H19Cl2NO3
InChI: InChI=1/C22H19Cl2NO3/c1-22(2)17(12-19(23)24)20(22)21(26)28-18(13-25)14-7-6-10-16(11-14)27-15-8-4-3-5-9-15/h3-12,17-18,20H,1-2H3
47 atoms
Cl 1.420599 -5.784015 -2.115379
Cl 4.217251 -5.130745 -1.843929
O  -0.448648 -0.14539 -0.6323
O  -1.637684 -2.032243 -0.44227
O  -1.568799 4.146482 2.246849
N  -0.750127 2.179178 -2.966113
C  0.715041 -2.970301 1.368479
C  0.972976 -3.46051 -0.02387
C  0.665194 -1.987772 0.214345
C  -0.547001 -3.432486 2.055925
C  1.865179 -2.789094 2.33026
C  2.31614 -3.821959 -0.490577
C  -0.598447 -1.441148 -0.306132
C  2.60038 -4.782233 -1.361672
C  -1.596903 0.555662 -1.10268
C  -2.250192 1.320674 0.019924
C  -1.110748 1.458699 -2.148015
C  -1.577339 2.391766 0.597705
C  -3.495686 0.930688 0.489989
C  -2.176946 3.092782 1.6331
C  -4.072619 1.627591 1.543543
C  -3.424936 2.711201 2.112436
C  -0.763425 4.981424 1.513664
C  0.471551 5.316197 2.047336
C  -1.18623 5.516782 0.302558
C  1.293165 6.198766 1.358867
C  -0.349871 6.386898 -0.380275
C  0.890665 6.730789 0.141923
H  0.155149 -4.021871 -0.461336
H  1.508075 -1.309035 0.153449
H  -1.341172 -3.707083 1.366453
H  -0.930078 -2.660527 2.726349
H  -0.323108 -4.312122 2.662377
H  2.149621 -3.747528 2.768563
H  1.568265 -2.127727 3.146083
H  2.75155 -2.354753 1.869164
H  3.15595 -3.257618 -0.102742
H  -2.315612 -0.126247 -1.565966
H  -0.597152 2.681134 0.23585
H  -4.014002 0.094604 0.038448
H  -5.044288 1.332788 1.91718
H  -3.882131 3.265131 2.922763
H  0.78481 4.892268 2.993348
H  -2.156165 5.262407 -0.107344
H  2.257228 6.462002 1.774931
H  -0.675587 6.802145 -1.325502
H  1.537519 7.41134 -0.395914
elementType: Cl O N C H
totalener: -2050.68635748 hartree
nucrepener: 2683.94402443 hartree
electener: -4734.63038191 hartree
oneelecener: -8143.39474617 hartree
twoeener: 3408.76436426 hartree
cpcmener: -0.02991580 hartree
kineticenergy: 2044.46483079 hartree
xcener: -151.861355700131 hartree
chargesum: -0.0000000
charge: -0.054530 -0.059328 -0.286171 -0.447049 -0.328523 -0.089152 0.091028 0.025876 -0.087045 -0.270353 -0.267814 -0.197193 0.405893 0.041189 0.422182 0.017725 -0.231006 -0.187762 -0.186412 0.226228 -0.118581 -0.222502 0.259690 -0.233503 -0.178528 -0.128124 -0.143462 -0.177066 0.082963 0.097442 0.096080 0.100910 0.097235 0.101825 0.098601 0.091684 0.128035 0.132854 0.142964 0.146154 0.158617 0.149053 0.147481 0.156803 0.157916 0.159356 0.158322
qa: -0.0545 -0.0593 -0.2862 -0.4470 -0.3285 -0.0892 0.0910 0.0259 -0.0870 -0.2704 -0.2678 -0.1972 0.4059 0.0412 0.4222 0.0177 -0.2310 -0.1878 -0.1864 0.2262 -0.1186 -0.2225 0.2597 -0.2335 -0.1785 -0.1281 -0.1435 -0.1771 0.0830 0.0974 0.0961 0.1009 0.0972 0.1018 0.0986 0.0917 0.1280 0.1329 0.1430 0.1462 0.1586 0.1491 0.1475 0.1568 0.1579 0.1594 0.1583
va: 1.2711 1.2454 2.1325 2.0643 2.0798 3.1061 3.7257 3.8781 3.8514 3.9042 3.9117 3.8995 4.1829 4.2152 3.7200 3.6432 4.0852 3.9553 3.9419 3.7871 3.9061 4.0054 3.7092 4.0079 3.9087 3.8867 3.8927 3.9003 1.0454 1.0327 1.0191 0.9990 1.0004 1.0004 1.0013 1.0059 1.0202 1.0245 1.0130 1.0069 0.9896 1.0046 1.0066 0.9963 0.9893 0.9902 0.9902
dispcorr: -0.022950607 hartree
energy: -2050.709308083608
dipole: -12.30031 12.17971 -0.12060 25.33111 -25.22952 0.10159 24.62930 -22.63535 1.99395
magnitude: 2.00017 au
magnitude: 5.08404 debye
