program: Orca
programVersion: 5.0.2
elementType: Cl Cl O O O N C C C C C C C C C C C C C C C C C C C C C C H H H H H H H H H H H H H H H H H H H
charge: 0
multiplicity: 1
keywords: wb97x-d3
keywords: def2-TZVPP
keywords: def2/J RIJCOSX
keywords: DEFGRID2
keywords: scfconv7
keywords: smallprint printgap noloewdin
keywords: NOSOSCF
formula: C22H19Cl2NO3
InChI: InChI=1/C22H19Cl2NO3/c1-22(2)17(12-19(23)24)20(22)21(26)28-18(13-25)14-7-6-10-16(11-14)27-15-8-4-3-5-9-15/h3-12,17-18,20H,1-2H3
47 atoms
Cl 0.288422 -0.272151 2.315871
Cl 2.262596 -1.347465 4.129989
O  -1.990546 -1.841532 -0.45757
O  -0.403521 -0.914804 -1.725299
O  -0.75625 3.574719 -0.415751
N  -3.265649 -0.547962 -3.387727
C  1.413188 -3.247106 -0.674079
C  1.584135 -2.036939 0.173301
C  0.184581 -2.563611 -0.094648
C  1.728701 -3.156017 -2.146496
C  1.717093 -4.600688 -0.07882
C  2.117321 -2.077952 1.551822
C  -0.71668 -1.696108 -0.864082
C  1.625854 -1.333557 2.532731
C  -2.930324 -0.831484 -0.812035
C  -2.626085 0.453271 -0.079104
C  -3.063291 -0.670326 -2.263522
C  -1.890889 1.476272 -0.659243
C  -3.018592 0.543198 1.252815
C  -1.505634 2.562829 0.114899
C  -2.661534 1.65275 2.001667
C  -1.887731 2.66039 1.443538
C  0.318193 3.243843 -1.202024
C  1.17079 2.197272 -0.870014
C  0.551476 4.016361 -2.330095
C  2.254432 1.919245 -1.689077
C  1.648245 3.734555 -3.133357
C  2.498618 2.682766 -2.822942
H  1.824721 -1.125184 -0.369355
H  -0.289111 -3.092714 0.723976
H  2.759069 -3.474533 -2.315908
H  1.629438 -2.150151 -2.547695
H  1.081655 -3.817715 -2.725063
H  1.446071 -4.668301 0.975534
H  2.781715 -4.826491 -0.165109
H  1.170155 -5.382014 -0.609148
H  2.964569 -2.718224 1.769942
H  -3.888273 -1.226017 -0.465922
H  -1.603096 1.431178 -1.701513
H  -3.59914 -0.251856 1.703916
H  -2.9707 1.727257 3.03569
H  -1.582961 3.515335 2.033807
H  0.998493 1.600293 0.01661
H  -0.120377 4.828639 -2.57748
H  2.915006 1.10096 -1.431928
H  1.828535 4.337164 -4.014242
H  3.345465 2.460325 -3.45863
elementType: Cl O N C H
totalener: -2050.67978456 hartree
nucrepener: 2987.30177198 hartree
electener: -5037.98155654 hartree
oneelecener: -8750.89371311 hartree
twoeener: 3712.91215658 hartree
cpcmener: -0.03261388 hartree
kineticenergy: 2044.49172579 hartree
xcener: -151.870419629031 hartree
chargesum: -0.0000000
charge: -0.057252 -0.056143 -0.281364 -0.441520 -0.332698 -0.083412 0.147565 -0.053038 -0.069270 -0.272818 -0.281003 -0.232693 0.366490 0.108749 0.455642 -0.009746 -0.243121 -0.136027 -0.243354 0.214289 -0.129981 -0.206350 0.255813 -0.158111 -0.221887 -0.172452 -0.136328 -0.164437 0.103610 0.108845 0.095585 0.093584 0.101182 0.093449 0.101959 0.100245 0.141444 0.141540 0.143113 0.140991 0.157928 0.148070 0.142975 0.145274 0.160652 0.156888 0.157125
qa: -0.0573 -0.0561 -0.2814 -0.4415 -0.3327 -0.0834 0.1476 -0.0530 -0.0693 -0.2728 -0.2810 -0.2327 0.3665 0.1087 0.4556 -0.0097 -0.2431 -0.1360 -0.2434 0.2143 -0.1300 -0.2064 0.2558 -0.1581 -0.2219 -0.1725 -0.1363 -0.1644 0.1036 0.1088 0.0956 0.0936 0.1012 0.0934 0.1020 0.1002 0.1414 0.1415 0.1431 0.1410 0.1579 0.1481 0.1430 0.1453 0.1607 0.1569 0.1571
va: 1.2992 1.2509 2.1305 2.0459 2.0794 3.1077 3.7259 3.8914 3.8305 3.8913 3.9110 3.9014 4.1375 4.1587 3.8760 3.5819 4.0665 3.9002 3.9649 3.8108 3.8538 3.9862 3.7190 3.8463 3.9885 3.9075 3.8992 3.8923 1.0173 1.0257 1.0012 1.0171 0.9991 0.9992 0.9993 1.0028 1.0090 0.9935 1.0201 1.0055 0.9899 1.0034 1.0077 1.0071 0.9880 0.9889 0.9902
dispcorr: -0.030138190 hartree
energy: -2050.709922748220
dipole: 7.00876 -6.18947 0.81928 -8.65497 7.06517 -1.58981 -20.05906 21.91737 1.85832
magnitude: 2.57916 au
magnitude: 6.55569 debye
