program: Gaussian 09
title: 000074435
version: EM64L-G09RevD.01
frameworkgroup: C1[X(C9H5F5)]
method: RPBEPBE
basis: SDD
operation: Freq
keyword: #p
keyword: freq=noraman
keyword: PBEPBE/SDD
title: #p freq=noraman PBEPBE/SDD
converged: YES YES NO NO
title: Mulliken charges:
elementType: F F F F F C C C C C C C C C H H H H H
charge: -0.156302 -0.158507 -0.146518 -0.146913 -0.144508 0.258464 -0.585150 0.098592 0.135504 0.068313 0.074816 0.111904 -0.025808 -0.561164 0.249396 0.239505 0.241855 0.224168 0.222352
chargesum: 0.00000
title: Mulliken charges with hydrogens summed into heavy atoms:
elementType: F F F F F C C C C C C C C C
charge: -0.156302 -0.158507 -0.146518 -0.146913 -0.144508 0.258464 -0.096250 0.098592 0.135504 0.068313 0.074816 0.111904 0.216048 -0.114643
polarizability: 1.30376904e+02 6.98504409e+00 1.03949797e+02 3.29502289e-01 9.51983857e-01 5.63786997e+01
1716.lowfreq: -3.8834 -0.0012 -0.0011 -0.0003 3.7573 8.2484 36.4649 56.7259 101.0784
frequency: 36.3490 56.7145 101.0703 121.7727 147.6392 180.0653 225.1716 252.3457 257.6399 265.2427 285.8692 303.9415 371.4628 373.9273 390.8992 426.3074 449.6173 524.4390 556.4556 612.1939 630.9206 680.4045 704.7793 751.0901 868.7114 901.8451 936.4683 949.0046 959.9449 1004.8499 1063.6751 1074.3822 1115.8295 1215.0595 1228.4647 1285.8059 1300.0900 1372.0018 1384.9936 1426.8859 1455.4982 1461.2608 1465.3365 1607.4534 1624.0633 1659.1482 3004.0946 3082.2046 3092.7087 3112.7078 3202.4012
redmass: 4.2897 4.6089 3.1125 18.1956 7.3083 8.0276 4.9280 10.6747 16.0717 4.3909 16.4702 9.9935 5.6431 9.1091 3.2908 14.2934 4.9994 4.8481 4.8926 3.9753 12.0641 3.4090 5.7313 8.1498 3.1274 3.3880 2.8350 2.1843 1.4833 1.1585 9.5857 8.3364 1.9595 1.4077 6.3406 1.2697 1.3238 8.0360 9.9570 1.2025 8.0339 1.2053 6.0888 10.5293 11.6752 4.6561 1.0634 1.0950 1.0625 1.0954 1.1147
irintensity: 0.0168 0.0221 0.2152 0.0078 0.2953 1.9502 1.6785 0.4188 0.1447 0.8563 0.9714 2.9408 0.2432 0.0317 1.7130 0.0693 0.8994 1.8454 0.9914 11.2308 0.0058 17.4895 8.6200 7.9499 67.0288 35.5882 38.9813 82.1996 86.1879 14.5781 5.9028 30.5006 30.8835 7.0209 13.9262 4.2281 1.6681 1.0384 9.3600 19.2060 211.0819 41.2886 106.3540 0.0673 6.4654 14.8620 10.4393 0.4532 8.7666 8.2079 20.0616
temp: 298.150 k
press: 1.00000 atm
elementType: 9 9 9 9 9 6 6 6 6 6 6 6 6 6 1 1 1 1 1
symmnumber: 1
zpe: 308404.5 jmol-1
zpe.correction: 0.117465 hartree
zpe.thermalcorrener: 0.130472 hartree
zpe.thermalcorrenthalpy: 0.131416 hartree
zpe.thermalcorrgfe: 0.077221 hartree
zpe.sumelectzpe: -844.092122 hartree
zpe.sumelectthermal: -844.079115 hartree
zpe.sumelectthermalent: -844.078171 hartree
zpe.sumelectthermalfe: -844.132366 hartree
dipole: 2.6497 -0.1711 -0.4670
dipole: 2.6960
quadrupole: -79.8537 -87.5684 -74.6039
quadrupole: 0.5585 1.9242 -0.7090
quadrupole: 0.8216 -6.8931 6.0714 0.5585 1.9242 -0.7090
hfenergy: -844.2095872 hartree
pointgroup: C01 [X(C9H5F5)]
dipole: -1.035713 0.1235645 -0.1925275 debye
dipolederiv: -0.3745148 -0.3157423 -0.1053814 -0.2672504 -0.675318 -0.1477698 -0.084062 -0.1303396 -0.1487603 -0.3137337 0.2540082 -0.0203506 0.2265447 -0.8136319 0.0187138 -0.010182 0.0128096 -0.1150953 -0.4641557 -0.3623277 -0.0998139 -0.4141631 -0.6636777 -0.1242222 -0.1278257 -0.137974 -0.1160808 -0.3373538 0.3023261 -0.0147537 0.375781 -0.8117514 -0.0057344 -0.0282742 0.0079759 -0.0862414 -0.9815619 0.0838816 -0.1737304 0.0999636 -0.1654821 0.0120169 -0.2154442 0.0125101 -0.1193938 0.1534883 -0.035583 0.0256608 -0.0205142 -0.2057533 -0.0495528 0.0509497 -0.0067926 -0.1045219 0.0552538 -0.0096136 0.0459871 0.0050243 0.0683336 -0.0040121 0.1971694 -0.0538857 0.0683705 0.3179104 0.4033106 0.1338787 0.2732852 0.7230258 0.1719716 0.0777802 0.1507009 0.1269702 0.2654922 -0.3181732 0.0207904 -0.236635 0.8818286 -0.0164504 0.003495 -0.0135321 0.0717479 0.3880288 0.489091 0.0941492 0.517134 0.6564358 0.1485294 0.1200237 0.1682159 0.1043302 0.231717 -0.4110752 -0.0214407 -0.4389085 0.8541343 -0.0096131 -0.0016712 -0.0319298 0.065434 1.0458927 -0.0998106 0.2041097 -0.1203052 0.0949348 -0.0244032 0.2314327 -0.0212764 0.1158953 -0.0225627 0.1107458 -0.1636773 0.0517752 0.0312726 0.1287618 -0.4261817 0.1010269 0.0963602 -0.3089984 0.1011138 -0.0865399 0.117413 -0.0711002 0.18232 -0.0111215 0.1683398 -0.074457 0.0186242 -0.0104939 0.0258403 0.0333067 0.0079952 0.0994279 0.0223684 0.0709643 0.0098578 0.0273435 -0.028864 -0.0188098 -0.0394651 -0.0055843 -0.1026856 -0.0010456 -0.0372312 0.052463 0.0979048 -0.0894129 0.0122502 -0.0492685 -0.0114663 -0.1087296 0.0542888 -0.0745516 0.021295 0.0732383 -0.0191648 0.1155215 -0.0503619 0.1096841 -0.0638649 0.1580705 -0.0600013 -0.015508 0.127987 -0.0442161 0.02631 -0.0633558 -0.0038796 -0.1047034 -0.0097702 -0.1250293 0.0473344 unknown
polarizability: 130.8353053|5.9034033|103.2210842|1.594917|3.570636|56.6490114 unknown
InChI: InChI=1S/C9H5F5/c1-2-3-4-5(10)7(12)9(14)8(13)6(4)11/h2H,1,3H2
charge 0 multiplicity 1
19 atoms
F  -0.924552 -2.2766 -0.693992
F  -0.494893 2.517528 -0.178503
F  2.197104 2.208713 0.451027
F  1.760007 -2.586069 -0.06466
F  3.334224 -0.348095 0.514858
C  -0.774465 0.129629 -0.449795
C  -2.254317 0.306896 -0.761386
C  -0.163659 -1.140897 -0.407846
C  0.054372 1.231588 -0.150761
C  1.418615 1.094591 0.167513
C  1.197845 -1.31684 -0.091338
C  1.99255 -0.191414 0.199782
C  -3.070902 0.537071 0.505515
C  -4.07828 -0.268741 0.918947
H  -2.371655 1.175871 -1.436379
H  -2.62802 -0.585704 -1.289287
H  -2.805663 1.427931 1.092446
H  -4.643607 -0.050875 1.831826
H  -4.367903 -1.167484 0.360733
