program: Orca
programVersion: 5.0.2
elementType: Cl Cl O O O N C C C C C C C C C C C C C C C C C C C C C C H H H H H H H H H H H H H H H H H H H
charge: 0
multiplicity: 1
keywords: wb97x-d3
keywords: def2-TZVPP
keywords: def2/J RIJCOSX
keywords: DEFGRID2
keywords: scfconv7
keywords: smallprint printgap noloewdin
keywords: NOSOSCF
formula: C22H19Cl2NO3
InChI: InChI=1/C22H19Cl2NO3/c1-22(2)17(12-19(23)24)20(22)21(26)28-18(13-25)14-7-6-10-16(11-14)27-15-8-4-3-5-9-15/h3-12,17-18,20H,1-2H3
47 atoms
Cl 0.868908 -6.148917 -1.13998
Cl 3.626973 -5.778209 -1.899922
O  -0.386142 0.001462 -0.998092
O  -1.488601 -1.788654 -0.230171
O  -1.393353 4.138141 2.173177
N  -1.179927 2.330815 -3.215355
C  1.254289 -2.330042 1.199093
C  1.089386 -3.22756 0.009475
C  0.902091 -1.731043 -0.149164
C  0.222273 -2.415773 2.297082
C  2.637853 -2.019593 1.719843
C  2.229779 -3.877803 -0.646798
C  -0.4526 -1.220512 -0.441075
C  2.230902 -5.1030 -1.157787
C  -1.629259 0.639216 -1.275091
C  -2.177098 1.336343 -0.054083
C  -1.35935 1.584447 -2.360897
C  -1.505916 2.438674 0.462817
C  -3.319985 0.852335 0.562433
C  -2.002165 3.072022 1.592996
C  -3.800624 1.488223 1.698231
C  -3.153069 2.596216 2.2128
C  -0.642366 4.997741 1.417383
C  0.611308 5.344902 1.895344
C  -1.131426 5.551829 0.241188
C  1.380986 6.257795 1.189547
C  -0.346486 6.452147 -0.460933
C  0.909462 6.809739 0.008377
H  0.163614 -3.791098 -0.002558
H  1.701998 -1.183485 -0.634818
H  0.117174 -1.455467 2.805136
H  0.543589 -3.148991 3.038536
H  -0.759277 -2.714666 1.939106
H  2.999771 -2.834306 2.348902
H  2.616491 -1.113664 2.326964
H  3.37182 -1.859919 0.930816
H  3.155836 -3.322987 -0.731404
H  -2.359293 -0.088996 -1.64194
H  -0.60889 2.805627 -0.021691
H  -3.825623 -0.018348 0.167615
H  -4.693269 1.119377 2.185028
H  -3.528382 3.100998 3.093204
H  0.973057 4.905735 2.81573
H  -2.113419 5.283357 -0.126787
H  2.35845 6.531262 1.564254
H  -0.724153 6.878692 -1.380486
H  1.515682 7.514758 -0.543786
totalener: -2050.66208165 hartree
nucrepener: 2699.14828697 hartree
electener: -4749.81036862 hartree
oneelecener: -8173.66110349 hartree
twoeener: 3423.85073487 hartree
kineticenergy: 2044.53234565 hartree
xcener: -151.871018086527 hartree
chargesum: -0.0000000
charge: -0.038563 -0.044406 -0.263700 -0.379058 -0.297120 -0.003074 0.065613 0.043477 -0.088520 -0.245647 -0.249331 -0.205034 0.356672 0.052956 0.333869 0.004271 -0.266996 -0.185548 -0.134507 0.221717 -0.089756 -0.203824 0.243614 -0.207338 -0.169258 -0.092660 -0.099844 -0.141444 0.086175 0.083232 0.089832 0.089752 0.101303 0.100525 0.094689 0.074293 0.097116 0.121063 0.129467 0.117090 0.128644 0.129652 0.124424 0.133715 0.125671 0.129769 0.127029
qa: -0.0386 -0.0444 -0.2637 -0.3791 -0.2971 -0.0031 0.0656 0.0435 -0.0885 -0.2456 -0.2493 -0.2050 0.3567 0.0530 0.3339 0.0043 -0.2670 -0.1855 -0.1345 0.2217 -0.0898 -0.2038 0.2436 -0.2073 -0.1693 -0.0927 -0.0998 -0.1414 0.0862 0.0832 0.0898 0.0898 0.1013 0.1005 0.0947 0.0743 0.0971 0.1211 0.1295 0.1171 0.1286 0.1297 0.1244 0.1337 0.1257 0.1298 0.1270
va: 1.2888 1.2606 2.1381 2.1260 2.1162 3.1177 3.7649 3.8294 3.8663 3.9148 3.9101 3.9245 4.2393 4.2537 3.8319 3.6649 4.0278 3.9684 3.9908 3.8539 3.9538 4.0343 3.7965 4.0457 3.9633 3.9310 3.9474 3.9615 1.0512 1.0342 1.0017 1.0015 1.0209 1.0022 1.0042 1.0102 1.0317 1.0184 1.0174 1.0198 0.9996 1.0117 1.0135 1.0032 0.9990 0.9997 1.0002
dispcorr: -0.023326161 hartree
energy: -2050.685407807319
dipole: -5.04949 5.32923 0.27974 31.84149 -31.61378 0.22771 21.07918 -19.71022 1.36896
magnitude: 1.41569 au
magnitude: 3.59839 debye
