program: Orca
programVersion: 5.0.2
elementType: Cl Cl O O O N C C C C C C C C C C C C C C C C C C C C C C H H H H H H H H H H H H H H H H H H H
charge: 0
multiplicity: 1
keywords: wb97x-d3
keywords: def2-TZVPP
keywords: def2/J RIJCOSX
keywords: DEFGRID2
keywords: scfconv7
keywords: smallprint printgap noloewdin
keywords: NOSOSCF
formula: C22H19Cl2NO3
InChI: InChI=1/C22H19Cl2NO3/c1-22(2)17(12-19(23)24)20(22)21(26)28-18(13-25)14-7-6-10-16(11-14)27-15-8-4-3-5-9-15/h3-12,17-18,20H,1-2H3
47 atoms
Cl 0.855532 -6.272035 -1.226518
Cl 3.626204 -5.867661 -1.922755
O  -0.25434 0.002606 -0.856009
O  -1.49077 -1.786299 -0.323702
O  -1.45167 4.235083 2.232149
N  -0.72472 2.453453 -3.023912
C  1.11654 -2.598609 1.232291
C  1.013919 -3.362495 -0.054698
C  0.888754 -1.851858 -0.067058
C  0.002389 -2.760086 2.237307
C  2.467866 -2.401343 1.878023
C  2.179577 -3.9909 -0.688544
C  -0.418006 -1.254302 -0.408784
C  2.206737 -5.211735 -1.208944
C  -1.436499 0.717411 -1.205534
C  -2.049387 1.398338 -0.0065
C  -1.025317 1.685815 -2.224415
C  -1.437736 2.522899 0.534014
C  -3.198706 0.876358 0.567627
C  -2.000445 3.142719 1.640495
C  -3.742522 1.495673 1.683369
C  -3.154845 2.627465 2.218806
C  -0.74384 5.135869 1.482474
C  0.474516 5.56885 1.981046
C  -1.242625 5.644535 0.289903
C  1.197779 6.522499 1.279967
C  -0.503138 6.586285 -0.407064
C  0.716755 7.030007 0.082908
H  0.0742 -3.885504 -0.19075
H  1.742844 -1.292324 -0.431476
H  0.24474 -3.578961 2.916456
H  -0.957166 -2.982634 1.778208
H  -0.112425 -1.855451 2.837119
H  2.755509 -3.291482 2.439526
H  2.433479 -1.56346 2.575507
H  3.261451 -2.192192 1.161874
H  3.101055 -3.424757 -0.743322
H  -2.169296 0.043643 -1.66013
H  -0.53736 2.92321 0.083228
H  -3.661477 -0.008976 0.153531
H  -4.640316 1.096999 2.136066
H  -3.582724 3.121777 3.081047
H  0.845614 5.163214 2.913017
H  -2.196524 5.308457 -0.095658
H  2.147345 6.862685 1.671086
H  -0.887741 6.975955 -1.339926
H  1.287484 7.766624 -0.465766
totalener: -2050.66231319 hartree
nucrepener: 2686.86682526 hartree
electener: -4737.52913845 hartree
oneelecener: -8149.12508904 hartree
twoeener: 3411.59595059 hartree
kineticenergy: 2044.53927664 hartree
xcener: -151.872414622366 hartree
chargesum: -0.0000000
charge: -0.039127 -0.043643 -0.261383 -0.383292 -0.297375 -0.003003 0.066922 0.043055 -0.099913 -0.246856 -0.243099 -0.203502 0.364780 0.051456 0.330369 -0.000001 -0.267891 -0.174393 -0.133111 0.210462 -0.094521 -0.197539 0.238842 -0.207206 -0.162687 -0.091695 -0.098806 -0.141698 0.087667 0.083076 0.090191 0.100631 0.090154 0.100132 0.095395 0.073121 0.098465 0.123643 0.128649 0.119969 0.128487 0.129294 0.124247 0.131850 0.125028 0.128309 0.126547
qa: -0.0391 -0.0436 -0.2614 -0.3833 -0.2974 -0.0030 0.0669 0.0431 -0.0999 -0.2469 -0.2431 -0.2035 0.3648 0.0515 0.3304 -0.0000 -0.2679 -0.1744 -0.1331 0.2105 -0.0945 -0.1975 0.2388 -0.2072 -0.1627 -0.0917 -0.0988 -0.1417 0.0877 0.0831 0.0902 0.1006 0.0902 0.1001 0.0954 0.0731 0.0985 0.1236 0.1286 0.1200 0.1285 0.1293 0.1242 0.1318 0.1250 0.1283 0.1265
va: 1.2880 1.2617 2.1364 2.1210 2.1143 3.1153 3.7598 3.8230 3.8821 3.9151 3.9091 3.9207 4.2281 4.2507 3.8269 3.6649 4.0295 3.9728 3.9804 3.8645 3.9562 4.0329 3.8022 4.0440 3.9569 3.9313 3.9499 3.9624 1.0498 1.0354 1.0014 1.0209 1.0016 1.0026 1.0043 1.0101 1.0297 1.0173 1.0157 1.0214 0.9996 1.0115 1.0135 1.0034 0.9991 1.0001 1.0003
dispcorr: -0.023270520 hartree
energy: -2050.685583706009
dipole: -6.58739 6.70558 0.11819 30.98983 -30.85237 0.13746 21.44560 -20.10566 1.33994
magnitude: 1.35214 au
magnitude: 3.43688 debye
