program: Orca
programVersion: 5.0.2
elementType: Cl Cl O O O N C C C C C C C C C C C C C C C C C C C C C C H H H H H H H H H H H H H H H H H H H
charge: 0
multiplicity: 1
keywords: wb97x-d3
keywords: def2-TZVPP
keywords: def2/J RIJCOSX
keywords: DEFGRID2
keywords: scfconv7
keywords: smallprint printgap noloewdin
keywords: NOSOSCF
formula: C22H19Cl2NO3
InChI: InChI=1/C22H19Cl2NO3/c1-22(2)17(12-19(23)24)20(22)21(26)28-18(13-25)14-7-6-10-16(11-14)27-15-8-4-3-5-9-15/h3-12,17-18,20H,1-2H3
47 atoms
Cl 0.868744 -6.186479 -1.20232
Cl 3.638908 -5.807334 -1.913192
O  -0.327948 0.011598 -0.951787
O  -1.482458 -1.786456 -0.285237
O  -1.382365 4.184777 2.196741
N  -1.018428 2.392602 -3.149896
C  1.199478 -2.435214 1.205899
C  1.064286 -3.276131 -0.028308
C  0.904373 -1.771413 -0.125412
C  0.128567 -2.556233 2.262504
C  2.569089 -2.172841 1.786959
C  2.217878 -3.917543 -0.670144
C  -0.431596 -1.228051 -0.442508
C  2.229994 -5.139079 -1.189668
C  -1.550138 0.680482 -1.249073
C  -2.111765 1.368359 -0.029154
C  -1.234075 1.637246 -2.31199
C  -1.462208 2.482103 0.489846
C  -3.245448 0.861757 0.58718
C  -1.971108 3.105425 1.619968
C  -3.736887 1.485952 1.724654
C  -3.111207 2.60622 2.240443
C  -0.67047 5.068244 1.430653
C  0.573919 5.463125 1.895786
C  -1.189265 5.59801 0.255884
C  1.304011 6.399256 1.178428
C  -0.443204 6.52163 -0.458101
C  0.802916 6.927273 -0.001558
H  0.131365 -3.82355 -0.097446
H  1.728792 -1.215195 -0.557197
H  -0.843954 -2.820263 1.85628
H  0.020782 -1.620219 2.813504
H  0.412152 -3.330174 2.977296
H  2.898494 -3.023616 2.385279
H  2.540161 -1.298308 2.438101
H  3.330905 -1.985626 1.031116
H  3.144413 -3.360549 -0.733102
H  -2.28606 -0.026017 -1.645222
H  -0.572957 2.868255 0.005821
H  -3.735521 -0.016749 0.190264
H  -4.62228 1.099317 2.210918
H  -3.496778 3.10312 3.120935
H  0.959936 5.041885 2.814797
H  -2.163755 5.292005 -0.1029
H  2.274258 6.709625 1.543153
H  -0.84374 6.927964 -1.377195
H  1.378637 7.65018 -0.563141
totalener: -2050.66224247 hartree
nucrepener: 2694.39326553 hartree
electener: -4745.05550800 hartree
oneelecener: -8164.15895882 hartree
twoeener: 3419.10345081 hartree
kineticenergy: 2044.53560409 hartree
xcener: -151.871819110505 hartree
chargesum: 0.0000000
charge: -0.038881 -0.044173 -0.262816 -0.381574 -0.297339 -0.002876 0.066667 0.043732 -0.092870 -0.247214 -0.247432 -0.205074 0.360662 0.053194 0.333830 0.002406 -0.268565 -0.180893 -0.134813 0.216923 -0.091437 -0.201675 0.242032 -0.207874 -0.166087 -0.091855 -0.099352 -0.141965 0.086569 0.083208 0.101536 0.089976 0.090000 0.100520 0.094954 0.073949 0.097409 0.122300 0.129244 0.118801 0.128843 0.129704 0.124133 0.132779 0.125484 0.129113 0.126797
qa: -0.0389 -0.0442 -0.2628 -0.3816 -0.2973 -0.0029 0.0667 0.0437 -0.0929 -0.2472 -0.2474 -0.2051 0.3607 0.0532 0.3338 0.0024 -0.2686 -0.1809 -0.1348 0.2169 -0.0914 -0.2017 0.2420 -0.2079 -0.1661 -0.0919 -0.0994 -0.1420 0.0866 0.0832 0.1015 0.0900 0.0900 0.1005 0.0950 0.0739 0.0974 0.1223 0.1292 0.1188 0.1288 0.1297 0.1241 0.1328 0.1255 0.1291 0.1268
va: 1.2884 1.2610 2.1383 2.1225 2.1155 3.1168 3.7616 3.8258 3.8741 3.9146 3.9099 3.9240 4.2340 4.2520 3.8285 3.6655 4.0293 3.9711 3.9857 3.8579 3.9544 4.0347 3.7984 4.0450 3.9593 3.9308 3.9484 3.9623 1.0511 1.0344 1.0209 1.0016 1.0015 1.0023 1.0043 1.0101 1.0310 1.0180 1.0163 1.0205 0.9995 1.0115 1.0136 1.0032 0.9989 0.9998 1.0002
dispcorr: -0.023314421 hartree
energy: -2050.685556894303
dipole: -5.74265 5.96093 0.21827 31.46662 -31.27517 0.19144 21.30601 -19.93661 1.36939
magnitude: 1.39983 au
magnitude: 3.55810 debye
