program: Gaussian 09
title: 000074434
version: EM64L-G09RevD.01
frameworkgroup: C1[X(C11H10ClF3N2)]
method: RPBEPBE
basis: SDD
operation: Freq
keyword: #p
keyword: freq=noraman
keyword: PBEPBE/SDD
title: #p freq=noraman PBEPBE/SDD
converged: YES YES NO NO
title: Mulliken charges:
elementType: Cl F F F N N C C C C C C C C C C C H H H H H H H H H H
charge: -0.010399 -0.165621 -0.157702 -0.157920 -0.221232 -0.067423 0.344514 0.002596 0.205278 -0.378394 -0.338662 -0.474237 0.399095 -0.266511 -0.784125 -0.653325 0.249876 0.230371 0.235609 0.267976 0.291722 0.279162 0.234554 0.239741 0.226970 0.228497 0.239592
chargesum: 0.00000
title: Mulliken charges with hydrogens summed into heavy atoms:
elementType: Cl F F F N N C C C C C C C C C C C
charge: -0.010399 -0.165621 -0.157702 -0.157920 -0.221232 -0.067423 0.344514 0.002596 0.205278 0.087586 -0.070686 -0.182515 0.399095 -0.266511 -0.030668 0.041734 0.249876
polarizability: 2.12905261e+02 1.51968726e+01 1.49214144e+02 1.83112312e+00 -3.19509358e+00 7.80176604e+01
1716.lowfreq: -6.6843 0.0022 0.0023 0.0028 2.2591 7.2079 49.0464 49.1169 59.0068
frequency: 49.0064 49.0642 59.0018 89.9824 118.3652 139.8371 147.4299 168.4733 186.5766 205.5970 233.5734 259.9951 278.2657 291.7197 331.4954 343.9623 382.2647 401.1932 422.2190 439.9590 493.1348 509.9455 551.9249 594.9841 608.9719 655.5805 661.7895 685.3222 685.6943 751.7726 762.0547 782.5087 851.3887 878.5876 914.1079 922.8147 960.3817 994.6058 995.2336 1011.2411 1045.5510 1056.2134 1083.5440 1109.0531 1159.4070 1189.9392 1231.6313 1247.0199 1276.0538 1325.0897 1340.7222 1367.7392 1392.7083 1395.1909 1398.4724 1427.2777 1456.7197 1467.1904 1468.8047 1471.6426 1481.5053 1493.2212 1515.6666 1585.4542 1633.1031 2984.2714 2993.4657 3013.3415 3059.0953 3069.2109 3094.1921 3101.4170 3125.9634 3168.7632 3190.0429
redmass: 5.6628 7.6758 3.2292 5.2775 4.2681 5.8782 1.0972 3.5323 5.2920 1.6500 4.1421 4.2497 4.5086 3.4027 5.4344 8.0035 7.9808 7.7730 4.5021 3.5696 7.4980 9.4144 5.1231 4.4455 5.1198 5.7520 8.0075 8.7977 5.4287 6.2760 3.9354 1.2767 1.5094 3.9805 1.5023 4.4063 2.3186 1.8253 9.8607 7.6796 1.5086 2.8521 2.2623 3.4100 2.2185 3.6561 1.3324 2.2083 3.6331 2.1629 1.6986 2.6102 2.4427 1.4930 1.2734 6.5250 1.2240 2.1808 1.0435 1.2321 1.1359 1.1874 4.6028 9.6356 8.3727 1.0397 1.0357 1.0627 1.0975 1.1008 1.0998 1.1020 1.0964 1.0933 1.0927
irintensity: 0.2751 0.1607 0.2696 0.2258 0.1066 0.2291 0.3853 0.5631 2.5181 0.5233 0.7209 1.9236 1.7876 0.2273 4.7524 1.7368 0.1393 2.8704 4.1261 3.0284 2.3760 4.1400 11.3540 17.2190 26.5591 0.9355 3.9126 0.2850 1.2433 7.7659 0.1942 18.8204 22.5858 41.2342 60.9792 25.1064 16.6770 13.9532 211.1001 108.6328 2.9029 169.4574 7.0732 5.6681 3.2080 115.5501 1.0184 39.3574 159.0226 90.1752 77.2447 80.4774 7.3485 30.5941 11.3444 127.8162 8.0118 20.5541 17.4359 10.6960 1.4371 18.5873 33.5991 4.6526 81.0564 23.2875 16.7883 29.8331 14.9141 1.9136 35.2118 30.6724 4.0580 0.8653 1.4966
temp: 298.150 k
press: 1.00000 atm
elementType: 17 9 9 9 7 7 6 6 6 6 6 6 6 6 6 6 6 1 1 1 1 1 1 1 1 1 1
symmnumber: 1
zpe: 504158.4 jmol-1
zpe.correction: 0.192024 hartree
zpe.thermalcorrener: 0.208048 hartree
zpe.thermalcorrenthalpy: 0.208992 hartree
zpe.thermalcorrgfe: 0.147938 hartree
zpe.sumelectzpe: -1293.041645 hartree
zpe.sumelectthermal: -1293.025620 hartree
zpe.sumelectthermalent: -1293.024676 hartree
zpe.sumelectthermalfe: -1293.085730 hartree
dipole: -8.4627 2.8556 -0.4267
dipole: 8.9417
quadrupole: -95.8773 -106.1319 -106.9165
quadrupole: -6.0044 1.0108 -0.1512
quadrupole: 7.0979 -3.1567 -3.9412 -6.0044 1.0108 -0.1512
hfenergy: -1293.2336684 hartree
pointgroup: C01 [X(C11H10Cl1F3N2)]
dipole: 3.3803376 0.9582121 0.1761945 debye
polarizability: 211.2537555|-18.2581011|150.842429|2.1726408|3.2523485|78.0408814 unknown
InChI: InChI=1S/C11H10ClF3N2/c1-3-17-6(2)16-9-4-7(11(13,14)15)8(12)5-10(9)17/h4-5H,3H2,1-2H3
charge 0 multiplicity 1
27 atoms
Cl -2.269394 2.611584 0.227078
F  -3.44067 -1.785168 -0.300197
F  -3.8889 0.005385 1.005698
F  -3.75398 0.245853 -1.244381
N  2.47376 0.211112 0.261454
N  1.671436 -1.923272 -0.009331
C  1.082778 0.328271 0.183873
C  0.594126 -1.012148 0.021296
C  2.77485 -1.16699 0.132432
C  3.428664 1.330401 0.360937
C  0.219092 1.439247 0.247406
C  -0.788274 -1.247309 -0.081608
C  -1.675599 -0.148186 -0.02128
C  -1.156095 1.174187 0.143526
C  4.174211 -1.697703 0.169105
C  3.706499 2.001287 -1.001495
C  -3.153503 -0.40756 -0.136182
H  3.02273 2.067013 1.078534
H  4.365373 0.941952 0.795857
H  0.57234 2.466038 0.371385
H  -1.170741 -2.262598 -0.206269
H  4.135168 -2.782742 -0.007117
H  4.814802 -1.238841 -0.606633
H  4.656282 -1.524282 1.149783
H  4.147511 1.283239 -1.714812
H  4.41369 2.840143 -0.873701
H  2.778044 2.398289 -1.447257
