program: Orca
programVersion: 5.0.2
elementType: Cl Cl O O O N C C C C C C C C C C C C C C C C C C C C C C H H H H H H H H H H H H H H H H H H H
charge: 0
multiplicity: 1
keywords: wb97x-d3
keywords: def2-TZVPP
keywords: def2/J RIJCOSX
keywords: DEFGRID2
keywords: scfconv7
keywords: smallprint printgap noloewdin
keywords: NOSOSCF
formula: C22H19Cl2NO3
InChI: InChI=1/C22H19Cl2NO3/c1-22(2)17(12-19(23)24)20(22)21(26)28-18(13-25)14-7-6-10-16(11-14)27-15-8-4-3-5-9-15/h3-12,17-18,20H,1-2H3
47 atoms
Cl 4.465738 -3.241949 -0.129082
Cl 3.643366 -5.989549 0.187863
O  -1.745013 -1.199079 0.622997
O  0.228316 -0.160429 0.445392
O  -1.787843 4.548278 -0.58736
N  -4.539992 -0.729185 2.323704
C  0.57326 -2.346905 -1.816959
C  1.419514 -2.671213 -0.61907
C  -0.049735 -2.373121 -0.433399
C  0.818276 -1.035797 -2.523037
C  0.154945 -3.453956 -2.754649
C  1.905192 -4.033811 -0.354613
C  -0.455253 -1.125611 0.246339
C  3.169627 -4.369058 -0.129895
C  -2.301138 -0.015267 1.180897
C  -2.554983 1.036319 0.126462
C  -3.552509 -0.432125 1.818108
C  -2.024055 2.306026 0.294968
C  -3.302426 0.720854 -0.999345
C  -2.241925 3.273774 -0.678169
C  -3.511256 1.694595 -1.963321
C  -2.983314 2.964951 -1.812757
C  -0.820094 4.883179 0.321347
C  -1.121911 5.855801 1.260767
C  0.444832 4.312673 0.269243
C  -0.142348 6.270563 2.151087
C  1.411252 4.727685 1.171795
C  1.123772 5.70707 2.112424
H  2.083585 -1.872522 -0.308078
H  -0.703518 -3.217175 -0.242446
H  1.185383 -0.255852 -1.861048
H  -0.096819 -0.672739 -2.994269
H  1.560169 -1.179699 -3.309623
H  0.957317 -3.681655 -3.457834
H  -0.718288 -3.149274 -3.333042
H  -0.103267 -4.378853 -2.240475
H  1.182485 -4.840322 -0.333159
H  -1.645167 0.389362 1.958867
H  -1.436236 2.529237 1.175816
H  -3.722484 -0.268814 -1.123898
H  -4.093254 1.462999 -2.845246
H  -3.144726 3.72597 -2.56472
H  -2.113192 6.288924 1.283177
H  0.671638 3.551611 -0.466568
H  -0.374751 7.035261 2.880287
H  2.397096 4.283846 1.134285
H  1.88465 6.030824 2.809562
totalener: -2050.66098620 hartree
nucrepener: 2719.72469704 hartree
electener: -4770.38568324 hartree
oneelecener: -8214.64271121 hartree
twoeener: 3444.25702797 hartree
kineticenergy: 2044.53106234 hartree
xcener: -151.870008483056 hartree
chargesum: -0.0000000
charge: -0.039651 -0.042206 -0.259733 -0.368247 -0.292555 -0.000269 0.069982 0.040870 -0.090613 -0.242630 -0.236561 -0.201206 0.327729 0.045082 0.307247 0.013921 -0.253460 -0.125789 -0.218066 0.247989 -0.084245 -0.200744 0.234537 -0.187073 -0.174023 -0.102348 -0.109765 -0.133045 0.089414 0.082898 0.097279 0.088228 0.092216 0.099979 0.094525 0.072833 0.100721 0.118167 0.111374 0.123865 0.127933 0.127915 0.127151 0.135117 0.127589 0.129828 0.127842
qa: -0.0397 -0.0422 -0.2597 -0.3682 -0.2926 -0.0003 0.0700 0.0409 -0.0906 -0.2426 -0.2366 -0.2012 0.3277 0.0451 0.3072 0.0139 -0.2535 -0.1258 -0.2181 0.2480 -0.0842 -0.2007 0.2345 -0.1871 -0.1740 -0.1023 -0.1098 -0.1330 0.0894 0.0829 0.0973 0.0882 0.0922 0.1000 0.0945 0.0728 0.1007 0.1182 0.1114 0.1239 0.1279 0.1279 0.1272 0.1351 0.1276 0.1298 0.1278
va: 1.2877 1.2638 2.1329 2.1377 2.1214 3.1196 3.7709 3.8273 3.8684 3.9126 3.9042 3.9027 4.2667 4.2473 3.8520 3.6808 4.0177 3.9289 4.0281 3.8708 3.9395 4.0292 3.8046 4.0431 3.9810 3.9335 3.9405 3.9516 1.0471 1.0361 1.0200 1.0032 1.0025 1.0034 1.0044 1.0094 1.0267 1.0205 1.0200 1.0183 0.9990 1.0127 1.0120 1.0036 0.9992 0.9993 1.0000
dispcorr: -0.023916382 hartree
energy: -2050.684902586409
dipole: -16.66043 17.26394 0.60351 23.90997 -23.54369 0.36629 -12.70481 11.63987 -1.06494
magnitude: 1.27768 au
magnitude: 3.24762 debye
