program: Orca
programVersion: 5.0.2
elementType: Cl Cl O O O N C C C C C C C C C C C C C C C C C C C C C C H H H H H H H H H H H H H H H H H H H
charge: 0
multiplicity: 1
keywords: wb97x-d3
keywords: def2-TZVPP
keywords: def2/J RIJCOSX
keywords: DEFGRID2
keywords: scfconv7
keywords: smallprint printgap noloewdin
keywords: NOSOSCF
formula: C22H19Cl2NO3
InChI: InChI=1/C22H19Cl2NO3/c1-22(2)17(12-19(23)24)20(22)21(26)28-18(13-25)14-7-6-10-16(11-14)27-15-8-4-3-5-9-15/h3-12,17-18,20H,1-2H3
47 atoms
Cl 1.921531 -5.212575 0.888337
Cl 4.041342 -5.025783 -1.05934
O  -1.326209 -0.296666 -1.438921
O  -1.493708 -1.578557 0.389191
O  -1.615927 3.901738 1.431972
N  -3.424348 0.855432 -3.721791
C  1.561881 -0.735719 0.557136
C  1.410574 -2.186344 0.202394
C  0.652566 -1.142821 -0.587276
C  0.978635 -0.270844 1.869129
C  2.813321 0.016786 0.170526
C  2.477151 -2.94722 -0.457983
C  -0.816109 -1.067904 -0.456366
C  2.767206 -4.22245 -0.231006
C  -2.711232 -0.019912 -1.364642
C  -3.053825 1.017222 -0.315157
C  -3.090457 0.468996 -2.693184
C  -2.117061 1.974809 0.052012
C  -4.324413 1.021236 0.233718
C  -2.466438 2.941704 0.985524
C  -4.664035 2.001665 1.15479
C  -3.74501 2.961044 1.53384
C  -0.355572 4.000868 0.908035
C  -0.157468 4.491208 -0.375353
C  0.720303 3.645182 1.705702
C  1.134634 4.613918 -0.862008
C  2.009931 3.781938 1.211749
C  2.220526 4.258487 -0.073479
H  0.793042 -2.754234 0.888577
H  1.025779 -0.901305 -1.576347
H  0.68028 0.777236 1.806922
H  1.733978 -0.355016 2.652233
H  0.112816 -0.849425 2.181873
H  3.609182 -0.166207 0.894427
H  2.613492 1.089334 0.154257
H  3.192656 -0.255078 -0.813841
H  3.085291 -2.441135 -1.197456
H  -3.279812 -0.93525 -1.16626
H  -1.127585 1.963793 -0.385204
H  -5.04715 0.267051 -0.050439
H  -5.654637 2.012845 1.588864
H  -4.002048 3.722658 2.257909
H  -1.005875 4.775824 -0.984564
H  0.544459 3.277947 2.708581
H  1.292195 4.995405 -1.86195
H  2.851373 3.511785 1.836187
H  3.226769 4.362705 -0.456293
totalener: -2050.66022393 hartree
nucrepener: 2809.46088679 hartree
electener: -4860.12111072 hartree
oneelecener: -8393.85507003 hartree
twoeener: 3533.73395930 hartree
kineticenergy: 2044.53630429 hartree
xcener: -151.874107332002 hartree
chargesum: -0.0000000
charge: -0.038079 -0.045160 -0.275712 -0.351512 -0.293636 0.000766 0.089264 0.031749 -0.068818 -0.235607 -0.250505 -0.204400 0.303786 0.051073 0.296781 0.064734 -0.255409 -0.227454 -0.194563 0.293346 -0.070865 -0.215759 0.275455 -0.175608 -0.230901 -0.105056 -0.145247 -0.115513 0.085587 0.083285 0.064980 0.094457 0.107988 0.100267 0.084804 0.076992 0.096586 0.130345 0.126104 0.106616 0.127050 0.126788 0.136452 0.141100 0.133844 0.136509 0.133098
qa: -0.0381 -0.0452 -0.2757 -0.3515 -0.2936 0.0008 0.0893 0.0317 -0.0688 -0.2356 -0.2505 -0.2044 0.3038 0.0511 0.2968 0.0647 -0.2554 -0.2275 -0.1946 0.2933 -0.0709 -0.2158 0.2755 -0.1756 -0.2309 -0.1051 -0.1452 -0.1155 0.0856 0.0833 0.0650 0.0945 0.1080 0.1003 0.0848 0.0770 0.0966 0.1303 0.1261 0.1066 0.1270 0.1268 0.1365 0.1411 0.1338 0.1365 0.1331
va: 1.2895 1.2598 2.1039 2.1517 2.1286 3.1233 3.7391 3.8658 3.8259 3.8962 3.9088 3.9292 4.2896 4.2531 3.8362 3.7356 4.0085 3.9518 4.0742 3.7931 3.9466 4.0447 3.7451 3.9859 3.9736 3.9325 3.8751 3.8954 1.0524 1.0354 1.0159 1.0027 1.0232 1.0022 1.0152 1.0134 1.0327 1.0178 1.0263 1.0122 0.9990 1.0138 1.0046 1.0045 0.9979 0.9977 0.9979
dispcorr: -0.026838228 hartree
energy: -2050.687062160554
dipole: -3.43866 4.34428 0.90562 34.53885 -33.71633 0.82252 8.36804 -7.41638 0.95166
magnitude: 1.54995 au
magnitude: 3.93966 debye
