program: Gaussian 09
title: 000074468
version: EM64L-G09RevD.01
frameworkgroup: C1[X(C16H13NO)]
method: RPBEPBE
basis: SDD
operation: Freq
keyword: #p
keyword: freq=noraman
keyword: PBEPBE/SDD
title: #p freq=noraman PBEPBE/SDD
converged: YES YES NO NO
title: Mulliken charges:
elementType: O N C C C C C C C C C C C C C C C C H H H H H H H H H H H H H
charge: -0.242993 -0.232658 0.177203 0.201304 0.199302 0.072482 0.297643 -0.360444 -0.657314 -0.401163 -0.224895 -0.241219 -0.418097 -0.368570 -0.230881 -0.224840 -0.239185 -0.233442 0.237182 0.238704 0.266240 0.245361 0.288266 0.223440 0.226323 0.268265 0.247462 0.183325 0.234787 0.232626 0.235786
chargesum: 0.00000
title: Mulliken charges with hydrogens summed into heavy atoms:
elementType: O N C C C C C C C C C C C C C C C C
charge: -0.242993 -0.232658 0.177203 0.201304 0.199302 0.072482 0.297643 -0.123263 0.092991 -0.112898 -0.001455 -0.014896 -0.149832 -0.121108 -0.047556 0.009947 -0.006558 0.002344
polarizability: 2.96080530e+02 8.41524233e-01 1.89320411e+02 -7.37249920e-01 1.02959632e+01 9.61450553e+01
1716.lowfreq: -5.5511 -3.2824 -0.0007 -0.0005 -0.0004 9.0773 51.1009 57.9339 76.5076
frequency: 51.0871 57.9154 76.5024 103.8758 130.5536 149.7111 159.2781 182.3420 242.4827 257.9673 269.4905 294.7767 327.1227 385.5967 401.4530 408.5640 451.4934 493.7912 529.1201 558.3709 581.3329 597.6458 613.7463 671.7330 686.2656 704.1618 729.3516 758.2838 763.0864 767.2198 809.6193 853.3189 859.0116 866.1444 931.4225 947.8963 966.1644 981.7122 987.9316 989.9498 1000.2866 1010.4346 1014.5905 1030.2440 1060.8912 1084.0160 1119.9487 1127.0198 1131.2089 1170.6132 1174.9993 1191.6236 1235.7442 1253.2840 1313.3225 1318.7564 1361.8715 1372.0113 1378.6627 1405.2699 1412.0051 1432.1330 1436.9284 1464.3269 1472.7921 1474.2487 1477.7405 1492.8726 1524.4637 1579.7304 1582.9095 1592.6662 1612.4024 1624.5294 2892.4911 2985.0640 3065.0975 3122.0934 3127.3681 3129.5127 3134.0794 3143.0757 3145.5295 3155.1128 3160.0679 3169.1814 3180.4208
redmass: 4.7865 3.6002 4.9777 3.0636 2.1093 3.7381 2.1980 4.1359 3.4314 3.6382 4.6648 3.5996 4.2346 3.7420 5.3849 3.3255 3.4696 3.8184 5.5636 5.7068 3.7735 5.0018 6.3588 5.9184 4.8790 1.9924 3.8924 1.3471 3.6246 2.4282 3.8411 5.0066 1.2992 1.4019 1.4240 1.3665 1.7120 1.4822 4.6956 1.3157 1.3322 2.6220 2.8499 2.9436 2.3880 1.6297 1.3193 1.5720 1.8936 1.1575 1.0536 1.1190 3.6844 1.9529 1.5148 2.0551 2.7332 4.6759 1.5616 3.1777 6.1522 2.1387 1.8486 1.9937 2.3152 1.4368 1.6124 1.3740 6.1021 5.9631 6.2927 6.3343 6.1821 7.6519 1.0839 1.0365 1.1012 1.0975 1.0862 1.0856 1.0877 1.0910 1.0925 1.0965 1.0974 1.1016 1.0971
irintensity: 0.3789 0.5458 0.8623 0.1879 1.8010 3.3746 3.5536 3.9890 6.9211 2.4435 1.0857 0.0663 0.9811 3.7976 2.4984 0.8924 1.6739 10.4080 3.8065 9.8563 0.9017 0.9245 0.1789 3.3725 2.3232 29.7726 45.4067 116.8309 4.7533 7.9377 33.1982 5.8064 0.6400 1.1404 3.3895 3.7989 0.5169 0.3041 0.2390 1.0023 0.1401 3.1464 19.4601 12.9588 27.1323 9.6234 1.9151 23.5714 1.7813 1.1948 0.0091 0.6432 1.4672 19.5855 1.4550 11.7969 44.7639 0.5775 16.6113 58.8407 32.8800 10.3782 25.0688 42.1110 17.8022 13.0830 34.2226 6.1118 12.2490 104.1987 105.2788 103.0887 6.9379 0.1948 105.0578 49.1986 18.7977 6.7813 2.0207 0.8394 0.0808 18.4267 16.4341 26.1753 28.2396 20.2676 10.1869
temp: 298.150 k
press: 1.00000 atm
elementType: 8 7 6 6 6 6 6 6 6 6 6 6 6 6 6 6 6 6 1 1 1 1 1 1 1 1 1 1 1 1 1
symmnumber: 1
zpe: 639650.0 jmol-1
zpe.correction: 0.243630 hartree
zpe.thermalcorrener: 0.258409 hartree
zpe.thermalcorrenthalpy: 0.259353 hartree
zpe.thermalcorrgfe: 0.201585 hartree
zpe.sumelectzpe: -746.251210 hartree
zpe.sumelectthermal: -746.236431 hartree
zpe.sumelectthermalent: -746.235487 hartree
zpe.sumelectthermalfe: -746.293255 hartree
dipole: 3.1385 -6.0130 0.6239
dipole: 6.8114
quadrupole: -88.6520 -109.0645 -106.0044
quadrupole: 6.0154 -0.4406 4.4617
quadrupole: 12.5883 -7.8242 -4.7641 6.0154 -0.4406 4.4617
hfenergy: -746.4948399 hartree
pointgroup: C01 [X(C16H13N1O1)]
dipole: -1.24496 2.343414 -0.3740189 debye
polarizability: 296.0689632|1.5335366|177.9860437|0.7021155|-32.1591514|107.4909895 unknown
InChI: InChI=1S/C16H13NO/c1-17-15-10-6-5-9-13(15)14(11-18)16(17)12-7-3-2-4-8-12/h2-11H,1H3
charge 0 multiplicity 1
31 atoms
O  0.912578 -3.335088 0.61029
N  0.402252 1.266671 -0.194179
C  -0.367711 0.114786 0.025005
C  1.771725 0.927252 -0.12968
C  1.868441 -0.476306 0.140452
C  0.508041 -0.984956 0.23412
C  -1.846118 0.127204 0.02205
C  2.907272 1.75059 -0.281947
C  -0.07353 2.648475 -0.326087
C  3.145832 -1.080423 0.249598
C  4.169832 1.131201 -0.164025
C  4.286313 -0.265089 0.09674
C  -2.5655 -0.471575 1.093937
C  -2.579905 0.704271 -1.0530
C  0.106282 -2.373535 0.406071
C  -3.976679 -0.491317 1.090002
C  -3.990626 0.684258 -1.053876
C  -4.694914 0.086871 0.017766
H  2.825692 2.822107 -0.492476
H  0.074933 3.026013 -1.354693
H  -1.144179 2.700165 -0.080506
H  0.480129 3.300671 0.372508
H  3.222623 -2.151952 0.451469
H  5.077123 1.734716 -0.278741
H  5.284166 -0.709791 0.179525
H  -2.012757 -0.896206 1.938514
H  -2.041846 1.134289 -1.905651
H  -0.990553 -2.570479 0.32908
H  -4.514101 -0.953651 1.925003
H  -4.539016 1.122972 -1.894601
H  -5.7902 0.070256 0.015834
