program: Orca
programVersion: 5.0.2
elementType: Cl Cl O O O N C C C C C C C C C C C C C C C C C C C C C C H H H H H H H H H H H H H H H H H H H
charge: 0
multiplicity: 1
keywords: wb97x-d3
keywords: def2-TZVPP
keywords: def2/J RIJCOSX
keywords: DEFGRID2
keywords: scfconv7
keywords: smallprint printgap noloewdin
keywords: NOSOSCF
formula: C22H19Cl2NO3
InChI: InChI=1/C22H19Cl2NO3/c1-22(2)17(12-19(23)24)20(22)21(26)28-18(13-25)14-7-6-10-16(11-14)27-15-8-4-3-5-9-15/h3-12,17-18,20H,1-2H3
47 atoms
Cl -0.735194 -5.09493 -0.506211
Cl 1.143907 -7.003391 -1.585223
O  -1.02225 -0.923505 -0.735454
O  -0.036468 -1.253461 1.250435
O  0.373469 3.765345 1.618032
N  -4.26151 -0.568741 -1.322762
C  2.389482 -2.062613 -0.562319
C  1.71472 -3.279902 -0.026453
C  0.886427 -2.231313 -0.727337
C  2.951673 -1.052458 0.407628
C  3.187011 -2.175034 -1.839548
C  1.893514 -4.609945 -0.649824
C  -0.070912 -1.436691 0.063407
C  0.898329 -5.454741 -0.885036
C  -1.989701 -0.066787 -0.135379
C  -1.569828 1.375462 -0.282431
C  -3.257277 -0.352803 -0.809299
C  -0.834572 1.961211 0.739994
C  -1.859399 2.094788 -1.434638
C  -0.381614 3.265633 0.603496
C  -1.403149 3.397232 -1.557808
C  -0.661048 3.989864 -0.549528
C  0.267723 5.08625 1.95423
C  -0.966352 5.707833 2.099998
C  1.441308 5.781713 2.201846
C  -1.014633 7.036782 2.489854
C  1.377767 7.108456 2.600649
C  0.153038 7.74341 2.740285
H  1.58383 -3.298132 1.052921
H  0.55734 -2.460156 -1.734191
H  3.991862 -1.298671 0.62714
H  2.412692 -1.022177 1.350819
H  2.934356 -0.049437 -0.022128
H  4.211456 -2.48664 -1.625909
H  3.235022 -1.209423 -2.344545
H  2.76018 -2.893204 -2.540226
H  2.895889 -4.9320 -0.906562
H  -2.112435 -0.314333 0.923195
H  -0.600785 1.40888 1.641301
H  -2.443219 1.650387 -2.230228
H  -1.625445 3.961241 -2.453656
H  -0.306156 5.006125 -0.661148
H  -1.881972 5.160082 1.916392
H  2.393468 5.280608 2.087305
H  -1.975971 7.520108 2.604078
H  2.294558 7.649171 2.795232
H  0.107423 8.780187 3.044527
totalener: -2050.66035424 hartree
nucrepener: 2703.40664481 hartree
electener: -4754.06699904 hartree
oneelecener: -8182.23194656 hartree
twoeener: 3428.16494752 hartree
kineticenergy: 2044.54025443 hartree
xcener: -151.871834809901 hartree
chargesum: 0.0000000
charge: -0.027608 -0.039449 -0.251880 -0.387777 -0.296285 -0.004085 0.115192 -0.016589 -0.164843 -0.255439 -0.270395 -0.246288 0.390525 0.091713 0.310374 0.003105 -0.253401 -0.168993 -0.161176 0.185654 -0.113981 -0.145613 0.225627 -0.149914 -0.199796 -0.120375 -0.097386 -0.137797 0.110423 0.106409 0.086808 0.103564 0.091555 0.093372 0.096989 0.088801 0.118723 0.124994 0.130942 0.123037 0.131754 0.135690 0.134619 0.126113 0.128905 0.126752 0.127428
qa: -0.0276 -0.0394 -0.2519 -0.3878 -0.2963 -0.0041 0.1152 -0.0166 -0.1648 -0.2554 -0.2704 -0.2463 0.3905 0.0917 0.3104 0.0031 -0.2534 -0.1690 -0.1612 0.1857 -0.1140 -0.1456 0.2256 -0.1499 -0.1998 -0.1204 -0.0974 -0.1378 0.1104 0.1064 0.0868 0.1036 0.0916 0.0934 0.0970 0.0888 0.1187 0.1250 0.1309 0.1230 0.1318 0.1357 0.1346 0.1261 0.1289 0.1268 0.1274
va: 1.3052 1.2662 2.1229 2.1123 2.1061 3.1157 3.7256 3.8410 3.8922 3.9025 3.9144 3.9059 4.1599 4.2060 3.8134 3.7304 4.0231 3.9966 4.0358 3.9065 3.9624 3.9474 3.8150 3.9356 4.0329 3.9486 3.9400 3.9551 1.0250 1.0252 1.0032 1.0195 1.0016 1.0014 1.0060 1.0007 1.0169 1.0219 1.0320 1.0182 1.0009 1.0024 1.0027 1.0132 0.9997 0.9988 0.9999
dispcorr: -0.023869016 hartree
energy: -2050.684223251776
dipole: 16.70015 -14.95451 1.74564 41.16891 -39.87324 1.29566 5.32136 -5.34215 -0.02079
magnitude: 2.17404 au
magnitude: 5.52597 debye
