program: Orca
programVersion: 5.0.2
elementType: Cl Cl O O O N C C C C C C C C C C C C C C C C C C C C C C H H H H H H H H H H H H H H H H H H H
charge: 0
multiplicity: 1
keywords: wb97x-d3
keywords: def2-TZVPP
keywords: def2/J RIJCOSX
keywords: DEFGRID2
keywords: scfconv7
keywords: smallprint printgap noloewdin
keywords: NOSOSCF
formula: C22H19Cl2NO3
InChI: InChI=1/C22H19Cl2NO3/c1-22(2)17(12-19(23)24)20(22)21(26)28-18(13-25)14-7-6-10-16(11-14)27-15-8-4-3-5-9-15/h3-12,17-18,20H,1-2H3
47 atoms
Cl -0.880159 -5.014256 -0.246197
Cl 0.761119 -7.141314 -1.298533
O  -0.916437 -0.912741 -0.73476
O  0.240586 -1.133801 1.169881
O  0.287577 3.92746 1.778697
N  -4.142238 -0.394143 -1.220159
C  2.447588 -2.251245 -0.767153
C  1.732583 -3.370716 -0.088179
C  0.928268 -2.308841 -0.799492
C  3.164504 -1.223437 0.07295
C  3.12551 -2.522645 -2.089434
C  1.758916 -4.752485 -0.616851
C  0.088441 -1.4054 0.009731
C  0.688422 -5.530652 -0.708304
C  -1.814683 -0.011234 -0.096762
C  -1.353686 1.418053 -0.248546
C  -3.115106 -0.231772 -0.733126
C  -0.76077 2.057418 0.830468
C  -1.497894 2.080232 -1.461727
C  -0.316645 3.366437 0.697302
C  -1.046337 3.383202 -1.583729
C  -0.454578 4.034351 -0.512866
C  0.112895 5.259041 2.035889
C  -1.144706 5.849367 2.007581
C  1.232936 5.999228 2.381991
C  -1.269863 7.193119 2.322175
C  1.091468 7.340704 2.704545
C  -0.156192 7.944704 2.669445
H  1.692767 -3.302559 0.996461
H  0.499088 -2.582331 -1.75618
H  4.195068 -1.542023 0.238988
H  2.703768 -1.071439 1.04546
H  3.195967 -0.259798 -0.438004
H  3.215563 -1.602567 -2.668337
H  2.583099 -3.245272 -2.69969
H  4.133493 -2.911314 -1.931166
H  2.710832 -5.17306 -0.919672
H  -1.91535 -0.258741 0.964253
H  -0.633396 1.545055 1.775598
H  -1.96982 1.590322 -2.303793
H  -1.155276 3.90383 -2.525587
H  -0.106469 5.053287 -0.621602
H  -2.019011 5.266323 1.747619
H  2.203407 5.521251 2.402632
H  -2.249183 7.652576 2.302198
H  1.965797 7.916694 2.977143
H  -0.262238 8.992115 2.916843
totalener: -2050.66019947 hartree
nucrepener: 2694.61869480 hartree
electener: -4745.27889428 hartree
oneelecener: -8164.71025098 hartree
twoeener: 3419.43135670 hartree
kineticenergy: 2044.53615604 hartree
xcener: -151.870484843517 hartree
chargesum: 0.0000000
charge: -0.028170 -0.039359 -0.253684 -0.387386 -0.296179 -0.003392 0.112379 -0.018253 -0.164974 -0.252193 -0.269374 -0.245324 0.390067 0.092027 0.316140 -0.004894 -0.256419 -0.146754 -0.157711 0.177288 -0.121695 -0.134411 0.219268 -0.145992 -0.197721 -0.120358 -0.098191 -0.137014 0.109919 0.107143 0.086556 0.103504 0.091102 0.096390 0.088805 0.093886 0.118663 0.120407 0.123164 0.122043 0.130948 0.135335 0.135042 0.126747 0.128633 0.126859 0.127137
qa: -0.0282 -0.0394 -0.2537 -0.3874 -0.2962 -0.0034 0.1124 -0.0183 -0.1650 -0.2522 -0.2694 -0.2453 0.3901 0.0920 0.3161 -0.0049 -0.2564 -0.1468 -0.1577 0.1773 -0.1217 -0.1344 0.2193 -0.1460 -0.1977 -0.1204 -0.0982 -0.1370 0.1099 0.1071 0.0866 0.1035 0.0911 0.0964 0.0888 0.0939 0.1187 0.1204 0.1232 0.1220 0.1309 0.1353 0.1350 0.1267 0.1286 0.1269 0.1271
va: 1.3052 1.2666 2.1277 2.1134 2.1061 3.1177 3.7297 3.8397 3.8922 3.9018 3.9144 3.9060 4.1572 4.2056 3.8216 3.6965 4.0249 4.0148 4.0351 3.9201 3.9643 3.9356 3.8196 3.9363 4.0312 3.9493 3.9400 3.9544 1.0256 1.0248 1.0026 1.0198 1.0015 1.0064 1.0009 1.0013 1.0171 1.0210 1.0323 1.0161 1.0013 1.0026 1.0025 1.0129 0.9998 0.9988 0.9999
dispcorr: -0.023739305 hartree
energy: -2050.683938777914
dipole: 18.05640 -16.30335 1.75305 39.98426 -38.86365 1.12062 2.14288 -2.28988 -0.14701
magnitude: 2.08580 au
magnitude: 5.30169 debye
