program: Orca
programVersion: 5.0.2
elementType: Cl Cl O O O N C C C C C C C C C C C C C C C C C C C C C C H H H H H H H H H H H H H H H H H H H
charge: 0
multiplicity: 1
keywords: wb97x-d3
keywords: def2-TZVPP
keywords: def2/J RIJCOSX
keywords: DEFGRID2
keywords: scfconv7
keywords: smallprint printgap noloewdin
keywords: NOSOSCF
formula: C22H19Cl2NO3
InChI: InChI=1/C22H19Cl2NO3/c1-22(2)17(12-19(23)24)20(22)21(26)28-18(13-25)14-7-6-10-16(11-14)27-15-8-4-3-5-9-15/h3-12,17-18,20H,1-2H3
47 atoms
Cl 1.07434 -4.413483 -2.199259
Cl 3.572846 -5.459748 -1.19904
O  -0.92455 -0.434611 -1.375637
O  -1.89814 -2.113236 -0.260596
O  -1.654589 3.128803 2.254372
N  -1.919856 1.848089 -3.55837
C  0.868499 -1.782643 1.284065
C  0.767081 -3.098799 0.58234
C  0.481037 -1.839776 -0.186531
C  -0.161035 -1.434053 2.331109
C  2.233074 -1.203014 1.566552
C  1.969705 -3.902109 0.271243
C  -0.90383 -1.530345 -0.590217
C  2.178166 -4.507086 -0.890204
C  -2.204776 0.128858 -1.611152
C  -2.74456 0.820214 -0.379364
C  -2.024488 1.087146 -2.704386
C  -1.905083 1.661783 0.344559
C  -4.052997 0.612391 0.015342
C  -2.394812 2.299481 1.474556
C  -4.533679 1.266777 1.142309
C  -3.715445 2.104986 1.873128
C  -0.337272 3.347179 1.945554
C  0.006016 4.297019 0.99537
C  0.639497 2.634952 2.623741
C  1.345475 4.532194 0.724552
C  1.976726 2.882553 2.348876
C  2.333012 3.826546 1.397099
H  -0.117084 -3.685045 0.821632
H  1.242701 -1.488905 -0.873644
H  -1.125726 -1.903798 2.153495
H  -0.319703 -0.354991 2.373201
H  0.188287 -1.758279 3.312923
H  2.962473 -1.45145 0.795212
H  2.619146 -1.569655 2.520018
H  2.175557 -0.114904 1.62687
H  2.716125 -4.037236 1.045329
H  -2.913856 -0.635872 -1.945298
H  -0.882559 1.813555 0.022734
H  -4.692487 -0.060661 -0.540278
H  -5.555447 1.110742 1.460899
H  -4.083377 2.610151 2.756327
H  -0.768447 4.847576 0.476926
H  0.35187 1.906525 3.371125
H  1.616686 5.272756 -0.015791
H  2.741971 2.336005 2.884562
H  3.376117 4.016915 1.184108
totalener: -2050.65835374 hartree
nucrepener: 2848.31284634 hartree
electener: -4898.97120009 hartree
oneelecener: -8471.85537626 hartree
twoeener: 3572.88417617 hartree
kineticenergy: 2044.54144677 hartree
xcener: -151.872060507493 hartree
chargesum: -0.0000000
charge: -0.029721 -0.040446 -0.265304 -0.351584 -0.293492 -0.001974 0.134718 -0.013944 -0.141924 -0.237611 -0.270500 -0.250734 0.324237 0.090002 0.322111 0.058053 -0.257816 -0.256323 -0.162955 0.269371 -0.072694 -0.214169 0.234281 -0.152448 -0.191541 -0.116757 -0.142320 -0.108847 0.109644 0.104840 0.105990 0.059949 0.092670 0.090062 0.093654 0.083363 0.118094 0.123577 0.129490 0.105598 0.127208 0.127410 0.132190 0.140475 0.131305 0.134948 0.129863
qa: -0.0297 -0.0404 -0.2653 -0.3516 -0.2935 -0.0020 0.1347 -0.0139 -0.1419 -0.2376 -0.2705 -0.2507 0.3242 0.0900 0.3221 0.0581 -0.2578 -0.2563 -0.1630 0.2694 -0.0727 -0.2142 0.2343 -0.1524 -0.1915 -0.1168 -0.1423 -0.1088 0.1096 0.1048 0.1060 0.0599 0.0927 0.0901 0.0937 0.0834 0.1181 0.1236 0.1295 0.1056 0.1272 0.1274 0.1322 0.1405 0.1313 0.1349 0.1299
va: 1.3014 1.2656 2.1144 2.1522 2.1203 3.1225 3.7109 3.8567 3.8470 3.8951 3.9119 3.9113 4.2552 4.2087 3.8258 3.6882 4.0279 3.9361 4.0477 3.7994 3.9487 4.0515 3.8108 3.9937 3.9836 3.9510 3.9217 3.9457 1.0254 1.0251 1.0213 1.0123 1.0039 1.0039 1.0006 1.0184 1.0168 1.0193 1.0307 1.0143 0.9991 1.0135 1.0067 0.9999 0.9990 0.9965 0.9991
dispcorr: -0.027792932 hartree
energy: -2050.686146675669
dipole: -4.69120 5.25096 0.55975 25.58844 -25.59581 -0.00737 25.14421 -23.47401 1.67020
magnitude: 1.76152 au
magnitude: 4.47742 debye
