program: Gaussian 09
title: 000069421
version: EM64L-G09RevD.01
frameworkgroup: C1[X(C16H33NO)]
method: RPBEPBE
basis: SDD
operation: Freq
keyword: #p
keyword: freq=noraman
keyword: PBEPBE/SDD
title: #p freq=noraman PBEPBE/SDD
converged: YES YES NO NO
title: Mulliken charges:
elementType: O N C C C C C C C C C C C C C C C C H H H H H H H H H H H H H H H H H H H H H H H H H H H H H H H H H
charge: -0.256726 -0.621233 -0.386410 -0.386103 -0.385893 -0.386293 -0.384974 -0.384218 -0.381978 -0.385836 -0.372958 -0.371017 -0.353398 -0.371063 -0.356815 -0.537932 -0.696805 0.223668 0.193833 0.193800 0.192940 0.192919 0.193040 0.193034 0.194365 0.194327 0.193043 0.193032 0.191817 0.191795 0.191589 0.191586 0.196235 0.196313 0.189372 0.189360 0.186297 0.186315 0.187434 0.187446 0.220322 0.221035 0.194779 0.194795 0.233856 0.233334 0.209530 0.209511 0.214814 0.331177 0.312942
chargesum: 0.00000
title: Mulliken charges with hydrogens summed into heavy atoms:
elementType: O N C C C C C C C C C C C C C C C C
charge: -0.256726 0.022885 0.001223 -0.000244 0.000181 0.002399 0.001101 -0.000606 0.001197 0.006712 0.005774 0.001595 0.021482 0.070294 0.032759 -0.070742 -0.062951 0.223668
polarizability: 2.52724752e+02 3.16788132e+00 1.64926067e+02 -3.79649906e-02 -3.01958778e-02 1.41449707e+02
1716.lowfreq: -27.1516 -2.5605 -0.0024 0.0006 0.0011 6.6802 15.8308 16.2889 32.5983
frequency: -16.0666 16.2438 17.6293 33.9394 46.1549 52.2643 60.2776 74.3130 87.9627 88.7782 99.7562 117.2128 122.5973 125.3717 143.2595 145.2362 147.2687 161.2765 162.5911 201.6224 224.1418 247.6419 270.8266 341.1874 353.9846 410.9780 438.6596 469.0102 481.0782 497.3251 506.6272 514.7062 589.1702 626.1787 722.2238 722.9605 724.4485 727.3725 735.7344 751.9604 777.0685 809.7437 835.3875 847.1404 886.7876 887.7028 929.6595 970.6278 974.8824 981.1985 1001.8725 1007.6814 1013.6079 1034.9183 1036.3202 1039.9978 1058.6783 1063.7125 1077.5506 1079.3237 1080.0238 1082.5140 1084.5342 1100.2461 1106.6281 1124.1883 1180.6564 1194.1361 1196.1789 1213.5340 1215.9100 1234.7014 1234.9235 1253.9038 1255.3851 1273.0497 1273.4502 1278.6005 1282.3792 1288.0803 1288.7639 1292.0148 1295.6856 1297.0768 1301.2903 1302.3830 1310.4798 1327.6584 1341.7081 1351.7490 1353.9952 1356.1459 1357.4637 1359.5001 1369.5438 1387.6755 1445.5353 1460.3351 1460.5256 1462.1510 1462.8910 1464.4013 1465.0806 1467.2544 1470.9177 1474.9958 1475.7181 1479.1090 1483.1109 1486.6519 1489.3165 1490.6366 1596.1566 1644.8360 2947.9123 2949.3443 2949.5814 2950.5720 2951.0550 2952.1928 2953.2212 2956.2681 2959.8675 2963.2372 2963.6968 2966.6381 2969.4515 2971.6155 2982.2783 2983.6915 2985.8213 2988.8198 2992.9987 2998.6941 3000.3615 3006.6994 3011.1818 3015.7360 3024.3240 3032.4147 3039.3810 3044.5366 3064.5194 3068.1898 3070.4050 3515.5277 3672.6771
redmass: 3.0770 4.5453 4.3780 3.8448 4.2470 2.0333 2.3066 1.7033 2.5375 4.1223 1.7096 2.3398 5.0609 1.7869 2.1935 3.8281 1.8776 2.0951 1.9764 3.8415 1.1371 4.3279 3.4819 3.3149 3.8078 3.0377 3.4357 2.8581 1.3583 3.1148 2.8751 1.2824 4.2276 1.4407 1.0580 1.0625 1.0686 1.0898 1.1174 1.1566 1.2036 1.2445 3.2431 1.2731 1.9033 1.2764 1.2567 1.2147 5.3384 5.1551 4.0421 1.1473 4.1748 2.9347 1.0611 2.9938 2.7318 2.6944 2.5758 2.3383 2.0772 2.1518 2.2212 2.9387 1.3907 3.1480 1.9473 1.7013 1.2488 1.5182 1.3281 1.3977 1.3561 1.3607 1.3155 1.3779 1.2425 1.0166 1.0369 1.1559 1.0598 1.4091 1.0736 1.1366 1.1002 1.1180 1.4433 1.4895 1.5348 1.5849 1.7196 1.6764 1.6416 1.6565 2.1656 1.2173 1.0848 1.0732 1.0731 1.0718 1.0706 1.0715 1.0600 1.0814 1.0840 1.0847 1.0425 1.0877 1.0921 1.0953 1.0972 1.0987 1.3952 3.8590 1.0588 1.0584 1.0584 1.0587 1.0588 1.0591 1.0595 1.0595 1.0594 1.0592 1.0588 1.0584 1.0583 1.0369 1.0958 1.0963 1.0972 1.0986 1.1001 1.1018 1.0602 1.1031 1.0995 1.1045 1.1051 1.1051 1.1048 1.1045 1.1037 1.1007 1.0992 1.0444 1.1044
irintensity: 6.6855 0.4155 0.1618 0.0338 1.1489 0.9764 0.1640 0.3834 0.0154 2.3102 0.1250 0.0200 0.2644 0.0528 0.0118 2.7233 0.0289 0.0019 0.0100 3.7802 0.0012 0.2475 2.5837 1.8361 0.5388 0.3120 2.2795 1.5279 25.0180 1.0899 1.1244 217.3686 3.8465 63.3412 17.2614 1.1422 17.3102 0.3600 4.4600 0.1617 3.2973 0.2390 1.1549 2.6371 4.9328 0.1174 1.4792 0.0153 0.1493 0.0305 1.7553 0.5701 2.0891 0.1754 0.0005 0.1876 0.4836 0.0698 0.5644 1.1914 0.7019 0.0167 0.8973 10.8722 0.2051 7.8790 0.0822 0.0512 19.9990 0.0317 6.5475 0.2911 7.7706 14.6308 0.0249 18.1008 0.0250 0.0004 0.5075 0.0891 0.0267 22.6015 0.3258 0.0007 0.0008 0.0694 24.5447 21.0549 20.6679 7.3512 1.8892 2.3250 3.9171 3.6190 72.9033 11.1980 14.2082 0.0632 0.0462 0.1492 0.0724 0.2452 0.0359 0.8684 0.5577 1.9878 12.2862 1.4778 1.5273 2.7718 1.5748 51.1584 69.5977 276.9087 6.2092 0.1392 0.5588 1.6853 0.8208 1.5930 0.3987 0.5178 3.5501 15.1015 2.0184 197.3540 237.1452 35.1186 0.2172 0.6762 1.3258 1.3320 1.3066 0.9530 30.7519 1.2949 10.6297 0.5342 0.0365 15.6790 0.0391 360.3992 91.0692 102.9595 55.8414 25.3120 20.6699
temp: 298.150 k
press: 1.00000 atm
elementType: 8 7 6 6 6 6 6 6 6 6 6 6 6 6 6 6 6 6 1 1 1 1 1 1 1 1 1 1 1 1 1 1 1 1 1 1 1 1 1 1 1 1 1 1 1 1 1 1 1 1 1
symmnumber: 1
zpe: 1217215.4 jmol-1
zpe.correction: 0.463613 hartree
zpe.thermalcorrener: 0.486824 hartree
zpe.thermalcorrenthalpy: 0.487768 hartree
zpe.thermalcorrgfe: 0.407147 hartree
zpe.sumelectzpe: -757.996970 hartree
zpe.sumelectthermal: -757.973759 hartree
zpe.sumelectthermalent: -757.972814 hartree
zpe.sumelectthermalfe: -758.053436 hartree
dipole: -0.6406 -3.8661 0.0146
dipole: 3.9189
quadrupole: -102.6825 -120.0485 -114.5772
quadrupole: 35.9348 -0.1389 -0.0017
quadrupole: 9.7536 -7.6125 -2.1411 35.9348 -0.1389 -0.0017
hfenergy: -758.4605827 hartree
pointgroup: C01 [X(C16H33N1O1)]
dipole: -0.2485836 -1.5216246 -0.0011775 debye
polarizability: 252.7098815|3.3670328|164.9406995|0.0778612|0.0760807|141.4499444 unknown
InChI: InChI=1S/C16H33NO/c1-2-3-4-5-6-7-8-9-10-11-12-13-14-15-16(17)18/h2-15,17H2,1H3
charge 0 multiplicity 1
51 atoms
O  -8.575155 1.433696 -0.008261
N  -9.702842 -0.589152 -0.008195
C  1.764862 0.385753 0.004171
C  0.491615 -0.489977 -0.00319
C  3.07394 -0.435539 -0.000557
C  -0.817397 0.33138 0.002277
C  4.347305 0.440064 0.00681
C  -2.090643 -0.544354 -0.005687
C  5.656274 -0.381428 0.00193
C  -3.398887 0.277871 0.000667
C  6.929851 0.494034 0.00952
C  -4.672516 -0.597264 -0.008605
C  8.238913 -0.327413 0.004133
C  -5.973979 0.233939 -0.001354
C  9.512557 0.548863 0.012356
C  -7.23591 -0.649101 -0.011129
C  10.81523 -0.280272 0.006598
C  -8.537736 0.168828 -0.008863
H  1.751609 1.058574 -0.878899
H  1.750051 1.045919 0.896737
H  0.506215 -1.149745 -0.896145
H  0.505224 -1.163118 0.879745
H  3.088712 -1.095717 -0.893179
H  3.087156 -1.108341 0.882603
H  -0.83082 1.004923 -0.880158
H  -0.832193 0.990807 0.895306
H  4.334097 1.113009 -0.876201
H  4.332625 1.100165 0.899453
H  -2.075828 -1.203316 -0.899324
H  -2.076626 -1.218209 0.87679
H  5.670966 -1.041492 -0.890781
H  5.669402 -1.054477 0.884909
H  -3.414028 0.936145 0.894242
H  -3.412456 0.952477 -0.880648
H  6.916667 1.167372 -0.873254
H  6.915429 1.153786 0.902485
H  -4.655113 -1.254881 -0.903723
H  -4.656139 -1.272341 0.873436
H  8.253583 -1.00101 0.886697
H  8.255161 -0.986854 -0.889044
H  -5.99779 0.892103 0.887655
H  -5.996914 0.909513 -0.877149
H  9.49514 1.207183 0.905029
H  9.496648 1.221719 -0.869425
H  -7.230079 -1.307758 -0.90429
H  -7.234694 -1.321797 0.871463
H  10.870811 -0.923544 -0.892034
H  10.868259 -0.939849 0.893491
H  11.710462 0.368607 0.01379
H  -10.599559 -0.103496 -0.007778
H  -9.68766 -1.607484 -0.008618
