program: Orca
programVersion: 5.0.2
elementType: Cl Cl O O O N C C C C C C C C C C C C C C C C C C C C C C H H H H H H H H H H H H H H H H H H H
charge: 0
multiplicity: 1
keywords: wb97x-d3
keywords: def2-TZVPP
keywords: def2/J RIJCOSX
keywords: DEFGRID2
keywords: scfconv7
keywords: smallprint printgap noloewdin
keywords: NOSOSCF
formula: C22H19Cl2NO3
InChI: InChI=1/C22H19Cl2NO3/c1-22(2)17(12-19(23)24)20(22)21(26)28-18(13-25)14-7-6-10-16(11-14)27-15-8-4-3-5-9-15/h3-12,17-18,20H,1-2H3
47 atoms
Cl 1.373989 -3.397468 -2.608743
Cl 3.812064 -4.823012 -2.007756
O  -0.673859 -0.373338 -0.763938
O  -1.800259 -2.153329 -0.004024
O  -1.825637 4.255758 1.630244
N  -1.344057 1.61203 -3.331001
C  0.807501 -2.662007 1.642196
C  0.810413 -3.511833 0.417394
C  0.570958 -2.025759 0.28077
C  -0.319263 -2.813722 2.634002
C  2.128996 -2.320367 2.289057
C  2.053806 -4.106449 -0.120239
C  -0.762654 -1.566422 -0.151524
C  2.370558 -4.108967 -1.408037
C  -1.895771 0.224885 -1.187205
C  -2.473246 1.088044 -0.093276
C  -1.571368 1.001044 -2.3858
C  -1.852846 2.288914 0.231022
C  -3.586158 0.654988 0.610928
C  -2.354938 3.057803 1.270808
C  -4.08707 1.440733 1.639614
C  -3.476898 2.634774 1.976308
C  -0.510577 4.521733 1.356037
C  -0.212596 5.653754 0.615836
C  0.501535 3.705632 1.844515
C  1.114049 5.973254 0.364787
C  1.821768 4.030062 1.577827
C  2.133435 5.161818 0.837671
H  -0.081013 -4.117916 0.2738
H  1.395521 -1.435623 -0.101459
H  -0.048334 -3.563512 3.379163
H  -1.252726 -3.124778 2.173225
H  -0.500835 -1.875971 3.161466
H  2.930298 -2.180874 1.563064
H  2.43574 -3.112102 2.975491
H  2.043284 -1.399723 2.867663
H  2.736576 -4.594192 0.56552
H  -2.619474 -0.543775 -1.473609
H  -0.992454 2.626261 -0.334336
H  -4.052516 -0.289574 0.365952
H  -4.957825 1.113537 2.191417
H  -3.861802 3.248802 2.779694
H  -1.015164 6.276754 0.243993
H  0.259127 2.826154 2.427287
H  1.347976 6.857236 -0.213001
H  2.612146 3.395334 1.95569
H  3.166068 5.409986 0.633387
totalener: -2050.65986162 hartree
nucrepener: 2776.15785895 hartree
electener: -4826.81772057 hartree
oneelecener: -8327.75846299 hartree
twoeener: 3500.94074242 hartree
kineticenergy: 2044.54588252 hartree
xcener: -151.872226988033 hartree
chargesum: 0.0000000
charge: -0.027342 -0.038815 -0.256017 -0.386999 -0.296559 -0.001092 0.113611 -0.019621 -0.161767 -0.250438 -0.270480 -0.245307 0.383065 0.091711 0.323998 -0.006966 -0.265174 -0.155112 -0.142313 0.203455 -0.090112 -0.198538 0.216987 -0.181024 -0.157431 -0.099099 -0.112521 -0.131407 0.110409 0.107774 0.085999 0.103813 0.089262 0.089320 0.094397 0.093939 0.118604 0.120055 0.132720 0.120348 0.128465 0.129741 0.127625 0.128356 0.127870 0.125783 0.126828
qa: -0.0273 -0.0388 -0.2560 -0.3870 -0.2966 -0.0011 0.1136 -0.0196 -0.1618 -0.2504 -0.2705 -0.2453 0.3831 0.0917 0.3240 -0.0070 -0.2652 -0.1551 -0.1423 0.2035 -0.0901 -0.1985 0.2170 -0.1810 -0.1574 -0.0991 -0.1125 -0.1314 0.1104 0.1078 0.0860 0.1038 0.0893 0.0893 0.0944 0.0939 0.1186 0.1201 0.1327 0.1203 0.1285 0.1297 0.1276 0.1284 0.1279 0.1258 0.1268
va: 1.3064 1.2672 2.1328 2.1135 2.1121 3.1177 3.7250 3.8465 3.8906 3.9005 3.9160 3.9057 4.1614 4.2064 3.8277 3.7059 4.0373 3.9615 3.9825 3.8813 3.9535 4.0307 3.8385 4.0403 3.9700 3.9395 3.9452 3.9601 1.0251 1.0243 1.0026 1.0208 1.0018 1.0007 1.0015 1.0065 1.0170 1.0220 1.0149 1.0194 0.9993 1.0114 1.0120 1.0045 0.9991 1.0001 1.0001
dispcorr: -0.024427751 hartree
energy: -2050.684289371882
dipole: -7.10151 7.50804 0.40653 16.81128 -17.16456 -0.35327 30.04623 -28.16415 1.88208
magnitude: 1.95762 au
magnitude: 4.97588 debye
