program: Gaussian 09
title: 000069420
version: EM64L-G09RevD.01
frameworkgroup: C1[X(C8H18O2)]
method: RPBEPBE
basis: SDD
operation: Freq
keyword: #pfreq=noraman
keyword: PBEPBE/SDD
title: #p freq=noraman PBEPBE/SDD
converged: YES YES NO NO
title: Mulliken charges:
elementType: O O C C C C C C C C H H H H H H H H H H H H H H H H H H
charge: -0.437940 -0.437946 -0.372941 -0.372819 -0.368315 -0.368223 -0.397906 -0.398405 -0.329441 -0.328923 0.195515 0.192961 0.195477 0.192889 0.194967 0.191751 0.194938 0.191752 0.185852 0.217927 0.217951 0.185822 0.215876 0.182609 0.182593 0.215807 0.329107 0.329064
chargesum: 0.00000
title: Mulliken charges with hydrogens summed into heavy atoms:
elementType: O O C C C C C C C C
charge: -0.108833 -0.108881 0.015534 0.015548 0.018402 0.018467 0.005873 0.005368 0.069044 0.069478
polarizability: 1.22087657e+02 -2.69937189e+00 8.48108710e+01 5.47775128e-01 -2.69905663e+00 7.90148374e+01
1716.lowfreq: -7.5996 0.0007 0.0009 0.0009 8.5659 31.3625 40.1090 48.3907 61.5575
frequency: 31.3624 48.3906 61.5496 77.5857 105.3505 127.9045 129.3039 146.4740 158.4652 212.1745 236.8894 314.5554 318.9436 371.2001 393.2629 480.3221 501.4619 723.4622 736.2279 762.7499 800.5820 858.0058 928.8122 946.3189 947.1124 1000.1869 1003.9379 1010.5006 1046.1862 1055.1318 1073.4641 1074.4360 1080.7985 1101.9249 1110.3515 1196.2250 1206.9958 1236.1185 1246.5101 1272.6720 1279.4603 1281.2791 1289.6377 1297.3768 1299.5434 1316.0318 1333.0644 1348.6173 1357.5954 1359.9793 1381.4563 1382.1772 1461.1931 1463.2383 1465.5268 1466.1207 1472.8243 1480.0641 1486.3022 1490.1915 2945.6132 2945.7523 2953.5845 2953.9469 2955.8979 2958.2426 2962.8880 2968.6003 2988.0267 2996.5768 3010.4337 3025.8984 3036.6070 3044.7155 3072.5772 3072.8681 3556.4855 3556.5772
redmass: 5.0262 5.2312 1.6136 3.7775 1.6606 2.8437 4.2929 1.8329 2.2090 5.3209 3.3152 1.1428 1.1554 3.2281 4.7306 3.1115 3.4970 1.0643 1.0853 1.1075 1.1502 1.2036 1.4781 5.3739 2.9366 2.1461 5.6440 1.5845 3.9680 3.1630 1.7527 2.2931 2.2065 1.2108 2.0574 1.6999 1.2439 1.4333 1.3125 1.2767 1.2601 1.0303 1.0915 1.0987 1.1597 1.2754 1.2938 1.3647 1.6679 1.5213 1.2533 1.2622 1.0765 1.0701 1.0846 1.0615 1.0895 1.0923 1.0956 1.0991 1.0688 1.0687 1.0593 1.0593 1.0609 1.0629 1.0629 1.0602 1.0962 1.0977 1.0995 1.0989 1.0988 1.1019 1.0977 1.0978 1.0661 1.0661
irintensity: 2.9094 1.3328 9.1936 0.0004 0.0001 6.7048 0.0399 2.1579 0.0000 0.0000 5.1430 0.6366 320.0827 0.0004 12.4532 13.6659 0.0001 13.8165 0.0005 7.8073 0.0000 8.6695 0.0004 152.1708 0.5696 20.9658 0.0068 5.2704 49.8505 0.0015 0.0008 2.4733 0.0009 62.5638 0.0161 0.0007 31.2491 6.4367 0.0004 0.0000 12.3195 0.0001 1.6787 0.0002 0.3905 0.0002 12.0890 0.0001 0.0102 1.4829 50.0538 0.6616 0.0000 0.3390 0.5708 0.0004 0.0002 0.1683 0.0090 28.0271 30.6188 74.5746 5.6664 5.0589 0.0243 12.8952 0.2003 218.2282 0.0079 8.1782 0.0109 12.2964 0.0643 161.1068 2.8717 131.9945 9.4057 3.8278
temp: 298.150 k
press: 1.00000 atm
elementType: 8 8 6 6 6 6 6 6 6 6 1 1 1 1 1 1 1 1 1 1 1 1 1 1 1 1 1 1
symmnumber: 1
zpe: 657054.2 jmol-1
zpe.correction: 0.250259 hartree
zpe.thermalcorrener: 0.263834 hartree
zpe.thermalcorrenthalpy: 0.264778 hartree
zpe.thermalcorrgfe: 0.208708 hartree
zpe.sumelectzpe: -465.213604 hartree
zpe.sumelectthermal: -465.200029 hartree
zpe.sumelectthermalent: -465.199085 hartree
zpe.sumelectthermalfe: -465.255155 hartree
dipole: 0.0072 0.0014 0.0053
dipole: 0.0090
quadrupole: -99.4161 -61.7406 -61.3693
quadrupole: -4.1920 16.6501 -3.1861
quadrupole: -25.2408 12.4348 12.8060 -4.1920 16.6501 -3.1861
hfenergy: -465.4638628 hartree
pointgroup: C01 [X(C8H18O2)]
dipole: 0.0028063 -0.000659 -0.002077 debye
polarizability: 122.0601021|2.7352291|84.4788025|-1.0340133|-3.0516063|79.3744613 unknown
InChI: InChI=1S/C8H18O2/c9-7-5-3-1-2-4-6-8-10/h9-10H,1-8H2
charge 0 multiplicity 1
28 atoms
O  5.740006 0.278868 0.022406
O  -5.737898 -0.284863 -0.022729
C  0.652878 0.412087 -0.0054
C  -0.650438 -0.417823 0.003017
C  1.928717 -0.460062 -0.010356
C  -1.926662 0.453602 0.006339
C  3.232088 0.371827 -0.01434
C  -3.229718 -0.378409 0.013695
C  4.495161 -0.507648 -0.021457
C  -4.49269 0.501303 0.01745
H  0.669351 1.079846 0.880967
H  0.659209 1.076198 -0.894877
H  -0.666254 -1.086854 -0.882498
H  -0.656957 -1.081066 0.893223
H  1.920972 -1.124652 0.878569
H  1.91069 -1.127957 -0.897203
H  -1.919667 1.115943 -0.884386
H  -1.90833 1.124243 0.891195
H  3.240155 1.036005 -0.905355
H  3.263828 1.03091 0.875151
H  -3.261682 -1.041145 -0.873078
H  -3.23777 -1.038886 0.907472
H  4.538956 -1.131525 0.887739
H  4.486357 -1.18332 -0.905316
H  -4.483611 1.180582 0.898515
H  -4.536427 1.121385 -0.894333
H  5.768366 0.870357 -0.772073
H  -5.76343 -0.877143 0.771262
