program: Gaussian 09
title: 000069419
version: EM64L-G09RevD.01
frameworkgroup: C1[X(C7H15NO)]
method: RPBEPBE
basis: SDD
operation: Freq
keyword: #p
keyword: freq=noraman
keyword: PBEPBE/SDD
title: #p freq=noraman PBEPBE/SDD
converged: YES YES NO NO
title: Mulliken charges:
elementType: O N C C C C C C C H H H H H H H H H H H H H H H
charge: -0.433852 -0.046721 -0.356359 -0.352554 -0.378146 -0.354448 -0.427609 -0.694442 -0.181963 0.187482 0.194004 0.190800 0.187863 0.194608 0.214724 0.195900 0.194964 0.224433 0.206086 0.216190 0.209891 0.210447 0.234828 0.363875
chargesum: 0.00000
title: Mulliken charges with hydrogens summed into heavy atoms:
elementType: O N C C C C C C C
charge: -0.069977 -0.046721 0.025127 0.026109 0.031187 0.036415 0.002910 -0.057915 0.052865
polarizability: 1.28346064e+02 6.09984103e+00 7.15193728e+01 7.20919646e+00 -1.64775245e+00 7.29511283e+01
1716.lowfreq: -4.6273 -0.0005 -0.0003 0.0007 10.7032 26.5560 40.7335 54.9026 72.4002
frequency: 40.6332 54.3980 72.3971 99.4945 125.7420 141.2927 169.3045 229.5723 247.9090 296.5614 307.0482 408.2480 425.6930 455.3677 560.5271 722.0268 736.0650 781.0611 842.4708 881.2632 890.8705 919.6807 974.6655 1001.5561 1020.1371 1044.5395 1068.2735 1079.1054 1114.5393 1147.2295 1192.7952 1211.1251 1227.6782 1241.9521 1275.9876 1277.0728 1284.0319 1291.3036 1317.8435 1345.8208 1353.8208 1368.3493 1390.2358 1453.7264 1463.0673 1465.2227 1473.1051 1477.0005 1481.4027 1488.0979 1607.6480 2953.0999 2956.9921 2965.7626 2968.2278 2972.6080 2973.4512 2990.1839 3004.8154 3023.5680 3037.2938 3047.4305 3061.8783 3069.2956 3072.0683 3568.7753
redmass: 3.2605 2.6808 2.4714 2.8661 1.8350 2.3465 3.8408 1.1213 3.9908 3.8760 3.0508 1.1513 2.7843 3.3801 3.3617 1.0651 1.1128 1.2471 2.2164 1.9950 1.8002 1.3885 1.4062 2.8313 3.1742 1.9886 2.3266 2.2286 2.2683 2.0117 1.5953 1.1730 1.2687 1.3167 1.1973 1.2157 1.0873 1.0972 1.3522 1.4836 1.6725 1.5481 1.2170 1.0877 1.0683 1.0780 1.0739 1.0434 1.0801 1.0883 6.4591 1.0591 1.0592 1.0613 1.0606 1.0376 1.0613 1.0968 1.0999 1.1011 1.1008 1.0935 1.0984 1.1007 1.0994 1.0675
irintensity: 0.0890 0.0196 0.0021 0.0301 0.0083 0.0023 0.2274 0.0031 0.2320 0.7546 2.9989 163.2566 8.7326 8.7824 21.8708 12.9250 0.3773 5.5206 59.0248 29.5762 30.7095 20.7645 18.6376 3.2807 3.6288 29.2671 9.6788 0.3619 11.2555 5.4067 2.4593 26.4908 16.9230 2.1058 1.5611 2.4007 0.2551 0.5888 4.2002 3.3963 0.6169 14.4273 11.1850 4.3323 0.0482 0.9978 1.9573 12.3267 4.3984 23.9147 0.3518 0.1229 8.4153 8.5364 25.5557 28.3270 137.5627 2.2441 1.3812 3.1039 54.1723 13.4939 61.8048 105.2821 55.1303 43.0164
temp: 298.150 k
press: 1.00000 atm
elementType: 8 7 6 6 6 6 6 6 6 1 1 1 1 1 1 1 1 1 1 1 1 1 1 1
symmnumber: 1
zpe: 551540.7 jmol-1
zpe.correction: 0.210071 hartree
zpe.thermalcorrener: 0.221891 hartree
zpe.thermalcorrenthalpy: 0.222835 hartree
zpe.thermalcorrgfe: 0.171395 hartree
zpe.sumelectzpe: -404.909078 hartree
zpe.sumelectthermal: -404.897257 hartree
zpe.sumelectthermalent: -404.896313 hartree
zpe.sumelectthermalfe: -404.947753 hartree
dipole: 1.1905 0.2422 0.1262
dipole: 1.2214
quadrupole: -58.4510 -58.3508 -55.8042
quadrupole: 0.3824 3.0211 1.1316
quadrupole: -0.9156 -0.8155 1.7311 0.3824 3.0211 1.1316
hfenergy: -405.1191483 hartree
pointgroup: C01 [X(C7H15N1O1)]
dipole: 0.4683115 0.0983252 0.0439361 debye
dipolederiv: -1.161994 -0.2442159 -0.0035168 -0.5686289 -0.53008 -0.1513541 0.4667236 0.0386778 -0.0845397 0.6382328 0.285241 0.1286702 0.5223519 -0.0219425 0.0638321 -0.3033528 -0.0979613 -0.2027369 -0.049503 0.019573 0.0117464 0.0802374 0.1033559 0.0289768 -0.0103907 0.0222012 0.1805617 -0.0730795 0.0051686 0.0127339 -0.0646753 0.0768928 0.0154036 0.0285725 0.0190229 0.1784318 0.0059048 -0.0182683 0.0147578 -0.1154886 0.0556908 -0.0049281 0.0546124 0.0136294 0.1859795 0.0320595 0.0133433 0.0065024 0.0816467 0.1009998 0.0156828 -0.0081512 0.0154998 0.1720129 -0.1556311 -0.0178298 0.0050958 -0.0010448 0.1055633 0.0491584 -0.0474255 0.0278183 0.1147344 -0.0786713 0.0545969 -0.0011338 0.0135385 0.0467937 0.0064703 0.0096174 0.0059073 0.0942516 0.1397703 0.0955609 0.0020564 0.2589604 -0.0009494 -0.0991253 -0.1251653 -0.1473982 0.1292519 0.0331483 -0.0158429 -0.0095476 -0.0143141 -0.0980971 -0.1140428 -0.0105738 -0.1404562 -0.0386195 0.0403907 0.0032651 -0.0041841 -0.0008114 0.0038643 0.0937641 0.001988 0.1192279 -0.1341036 0.0365456 -0.0235355 -0.0154223 -0.0114096 -0.0961072 -0.1126921 -0.013938 -0.137471 -0.0356239 0.0376552 -0.0000833 0.0041021 0.0052648 0.0039037 0.0968192 -0.0016253 0.1226088 -0.1425932 0.0446756 0.0102497 0.0007788 -0.001351 0.0073933 0.0921417 0.0042709 0.1187649 -0.1335788 0.03975 -0.0030936 -0.00718 -0.0050108 -0.0758799 -0.1014939 -0.0076417 -0.1244281 -0.0235872 0.0290512 0.0232889 -0.0293888 -0.0000686 0.0046678 0.1048926 0.002143 0.1301766 -0.1420372 0.0298125 0.0102153 0.0065507 -0.0195349 -0.1056394 -0.121611 -0.0139816 -0.1502588 -0.0347608 0.0606812 0.0097032 -0.0076652 0.0117504 0.0423077 0.0630719 0.0180773 0.1039206 -0.083502 0.0116168 -0.0597147 -0.0370131 -0.0459514 -0.059846 -0.1088226 0.0101667 -0.1287775 -0.0049942 -0.1980281 -0.0796681 0.035603 -0.1134474 0.0251164 0.0238971 0.0448481 0.0214243 0.0923347 0.0831141 0.0073526 0.0177682 0.0436903 0.0289266 0.0931095 -0.0390306 0.1155758 -0.1393301 0.0816613 -0.0245686 -0.0378124 0.0344932 -0.0751965 -0.1252489 -0.0019099 -0.1418085 -0.0319727 0.0479538 -0.0491508 -0.0158018 -0.0750953 0.1077008 0.1128736 -0.012629 0.1065189 -0.0584307 0.3248834 -0.001587 -0.0776999 -0.0151015 0.3505613 0.0792253 -0.0452043 0.0875848 0.142852 unknown
polarizability: 128.3433125|6.5409641|71.3502227|6.8244638|-1.5554023|73.1230296 unknown
InChI: InChI=1S/C7H15NO/c1-2-3-4-5-6-7-8-9/h7,9H,2-6H2,1H3
charge 0 multiplicity 1
24 atoms
O  -4.775121 -0.684862 0.003809
N  -3.608662 0.069028 -0.501553
C  1.204443 0.554308 -0.026546
C  2.432344 -0.377736 0.080867
C  -0.134683 -0.177942 0.213857
C  3.773858 0.351407 -0.161616
C  -1.35623 0.77455 0.107016
C  4.996097 -0.585599 -0.051762
C  -2.658834 0.074525 0.399706
H  1.307178 1.382737 0.705454
H  1.188859 1.026409 -1.030866
H  2.32988 -1.207012 -0.649682
H  2.449753 -0.849514 1.08571
H  -0.120501 -0.651839 1.21706
H  -0.24898 -0.999078 -0.520929
H  3.755945 0.821715 -1.166008
H  3.874504 1.180944 0.567814
H  -1.403712 1.223371 -0.902326
H  -1.221201 1.606521 0.829662
H  5.941582 -0.042291 -0.233371
H  5.056519 -1.042339 0.954224
H  4.931451 -1.407963 -0.789023
H  -2.78397 -0.435988 1.370587
H  -5.410318 -0.620053 -0.754881
