program: Gaussian 09
title: 000069418
version: EM64L-G09RevD.01
frameworkgroup: C1[X(C14H28O)]
method: RPBEPBE
basis: SDD
operation: Freq
keyword: #pfreq=noraman
keyword: PBEPBE/SDD
title: #p freq=noraman PBEPBE/SDD
converged: YES YES NO NO
title: Mulliken charges:
elementType: O C C C C C C C C C C C C C C H H H H H H H H H H H H H H H H H H H H H H H H H H H H
charge: -0.211414 -0.384657 -0.384825 -0.386013 -0.381965 -0.370771 -0.372906 -0.378730 -0.353433 -0.510378 -0.356742 0.216576 -0.696740 -0.472567 -0.676467 0.192248 0.192236 0.193708 0.193762 0.196028 0.195927 0.191519 0.191522 0.187837 0.187950 0.189653 0.189671 0.217170 0.218315 0.187416 0.187416 0.230078 0.230807 0.194920 0.194913 0.209497 0.215004 0.209498 0.226730 0.227279 0.231093 0.229815 0.209020
chargesum: 0.00000
title: Mulliken charges with hydrogens summed into heavy atoms:
elementType: O C C C C C C C C C C C C C C
charge: -0.211414 -0.000173 0.002645 0.005942 0.001076 0.005017 0.006419 0.056755 0.021399 -0.049493 0.033090 0.216576 -0.062742 -0.018558 -0.006539
polarizability: 2.06407795e+02 3.82584780e-01 1.39255593e+02 7.11877256e-02 1.98373152e-02 1.22033526e+02
1716.lowfreq: -19.8974 -2.9617 -0.0016 0.0007 0.0012 7.7995 20.7881 24.7798 32.2253
frequency: -12.8923 21.4240 24.8107 40.6766 50.3400 64.6549 68.7520 84.4486 96.5888 123.3529 131.0397 131.2915 151.4536 155.3361 157.3513 168.1005 205.6046 224.1700 267.4670 292.3420 330.9064 400.6559 426.5965 448.8602 481.9129 498.7008 628.9113 698.4559 722.4593 724.3678 731.4666 749.4569 779.2087 814.3152 816.7215 862.1162 886.9825 915.5992 966.7784 968.7874 988.8937 998.8251 1009.0038 1009.2727 1032.7010 1033.3707 1050.8779 1063.4697 1079.4956 1080.2632 1081.7739 1094.1719 1116.7624 1126.4443 1129.0026 1182.4713 1203.0838 1205.7971 1228.1663 1235.8668 1246.5361 1263.3937 1264.1122 1279.4109 1282.4539 1288.1414 1290.5605 1293.0236 1299.1126 1300.9553 1315.0050 1329.7798 1342.1265 1353.5975 1355.0101 1358.3378 1360.8166 1387.4777 1395.6581 1426.4233 1437.4965 1460.7714 1461.3755 1463.5944 1464.6554 1467.5044 1467.6615 1472.4542 1475.6479 1477.7061 1478.1497 1483.0536 1487.6217 1490.2562 1632.3909 2948.3646 2949.8660 2950.5526 2951.7215 2952.7199 2954.6914 2959.8276 2965.0357 2966.7662 2969.3611 2971.3954 2982.9167 2985.7723 2990.2397 2993.8359 2993.9674 2997.5877 2997.7467 3008.9600 3010.9412 3021.4931 3032.8708 3042.1959 3057.3397 3067.9757 3070.2202 3093.5724 3100.1879
redmass: 1.6451 3.4618 3.9665 3.3753 2.4619 2.0819 3.8603 2.1618 1.8214 2.1468 3.7590 1.8422 4.5783 2.0612 1.9136 1.1662 3.3979 1.1366 3.5467 4.1792 3.5712 3.2297 3.5529 1.9235 2.9790 3.1332 3.7246 1.1725 1.0586 1.0719 1.1045 1.1539 1.2106 3.7425 1.2585 1.2698 1.8994 1.2491 5.5158 1.2013 4.2373 3.5418 1.1542 1.8377 2.9957 1.0865 2.8423 2.8864 2.1677 2.2506 2.2744 2.5530 2.2787 3.0131 1.7474 1.8758 1.5677 1.2907 1.3703 1.3300 1.2569 1.3309 1.2595 1.0209 1.1408 1.0859 1.3440 1.0903 1.1182 1.1054 1.3980 1.6332 1.5946 1.6208 1.7023 1.6531 1.6927 1.2174 1.2092 1.0770 1.1063 1.0734 1.0725 1.0722 1.0634 1.0393 1.0787 1.0803 1.0426 1.0787 1.0536 1.0892 1.0942 1.0971 7.8104 1.0589 1.0585 1.0588 1.0591 1.0597 1.0594 1.0593 1.0587 1.0605 1.0582 1.0370 1.0961 1.0971 1.0987 1.0684 1.0884 1.0364 1.1014 1.1029 1.0981 1.1046 1.1049 1.1046 1.1034 1.1007 1.0993 1.1003 1.0998
irintensity: 0.6351 0.0334 0.4025 0.5165 1.6830 0.0114 0.8277 0.4022 0.0152 0.1483 0.8481 0.0056 0.0327 0.0588 0.0073 0.0822 0.2895 0.0010 7.2140 2.2381 3.7455 1.2668 0.1200 0.9607 0.2207 0.7289 2.5055 0.5116 18.3137 0.2023 7.1790 0.6347 7.6153 4.2383 1.9504 4.7486 4.6590 0.1816 20.9235 1.4188 7.5727 1.7820 0.0404 2.7089 2.3748 0.1166 5.5407 0.4034 1.2798 0.5671 0.0794 4.9867 9.7803 31.9066 0.6417 0.1943 0.0402 33.7412 0.0001 6.7717 0.2967 9.3249 0.3183 0.0598 0.0475 0.1011 5.2750 0.2395 0.0179 0.0512 2.6910 24.5916 24.6076 3.7364 3.3340 3.4572 8.1466 11.1338 22.2148 3.1840 37.0622 0.1116 0.0710 0.2505 0.1094 12.2196 1.1519 0.7453 12.3233 4.5089 12.8876 3.2716 2.2070 37.5939 82.0442 3.9376 1.0358 0.6760 2.8785 19.0337 2.9069 0.1634 84.4107 31.4564 195.4950 33.8956 0.4731 1.2191 2.2489 27.7749 8.2467 29.0054 0.5452 2.7252 14.5017 4.0560 0.0109 191.8572 108.2698 102.8094 55.5418 30.2860 33.2837
temp: 298.150 k
press: 1.00000 atm
elementType: 8 6 6 6 6 6 6 6 6 6 6 6 6 6 6 1 1 1 1 1 1 1 1 1 1 1 1 1 1 1 1 1 1 1 1 1 1 1 1 1 1 1 1
symmnumber: 1
zpe: 1022224.4 jmol-1
zpe.correction: 0.389345 hartree
zpe.thermalcorrener: 0.408953 hartree
zpe.thermalcorrenthalpy: 0.409897 hartree
zpe.thermalcorrgfe: 0.338282 hartree
zpe.sumelectzpe: -624.260748 hartree
zpe.sumelectthermal: -624.241140 hartree
zpe.sumelectthermalent: -624.240196 hartree
zpe.sumelectthermalfe: -624.311811 hartree
dipole: 0.2324 -2.9058 -0.0124
dipole: 2.9151
quadrupole: -99.0007 -101.3670 -94.2141
quadrupole: 17.3568 0.0947 -0.0045
quadrupole: -0.8067 -3.1731 3.9798 17.3568 0.0947 -0.0045
hfenergy: -624.650093 hartree
pointgroup: C01 [X(C14H28O1)]
dipole: 0.0904814 1.1432896 -0.0045524 debye
polarizability: 206.407843|-0.3289389|139.2542047|-0.2220128|-0.119308|122.0348671 unknown
InChI: InChI=1S/C14H28O/c1-3-5-6-7-8-9-10-11-12-13-14(15)4-2/h3-13H2,1-2H3
charge 0 multiplicity 1
43 atoms
O  -5.472328 -1.39158 0.022461
C  1.034567 0.494868 -0.003753
C  2.300027 -0.392072 0.005599
C  -0.280841 -0.315886 0.009706
C  3.616261 0.417672 -0.005728
C  -1.5470 0.570058 -0.002553
C  4.881593 -0.469681 0.003178
C  -2.85609 -0.249465 0.015755
C  6.198372 0.339279 -0.008232
C  -4.112139 0.641054 -0.000624
C  7.463403 -0.549324 0.001001
C  -5.435951 -0.132285 0.017047
C  8.774162 0.266922 -0.010823
C  -6.716997 0.712142 0.028138
C  -8.011418 -0.11867 0.02131
H  1.052974 1.149282 -0.900633
H  1.05643 1.17288 0.875331
H  2.281153 -1.047627 0.901436
H  2.279117 -1.069148 -0.874022
H  -0.301678 -0.995498 -0.867672
H  -0.299966 -0.968736 0.907238
H  3.637492 1.094477 0.874228
H  3.635248 1.073472 -0.90151
H  -1.527604 1.220468 -0.902725
H  -1.522686 1.252125 0.873735
H  4.862697 -1.125467 0.898963
H  4.86033 -1.146626 -0.876662
H  -2.881714 -0.899446 0.911484
H  -2.884571 -0.935051 -0.852786
H  6.221357 1.016305 0.871554
H  6.21919 0.99486 -0.904175
H  -4.107104 1.337351 0.865221
H  -4.110063 1.29737 -0.897432
H  7.439162 -1.225607 -0.877957
H  7.441477 -1.203783 0.896408
H  8.836189 0.928798 0.873776
H  9.662928 -0.390813 -0.003845
H  8.833839 0.906654 -0.911731
H  -6.682283 1.397968 -0.844176
H  -6.679103 1.375133 0.918053
H  -8.054466 -0.785604 0.899239
H  -8.061813 -0.760885 -0.874583
H  -8.898852 0.539019 0.033866
