program: Orca
programVersion: 5.0.2
elementType: Cl Cl O O O N C C C C C C C C C C C C C C C C C C C C C C H H H H H H H H H H H H H H H H H H H
charge: 0
multiplicity: 1
keywords: wb97x-d3
keywords: def2-TZVPP
keywords: def2/J RIJCOSX
keywords: DEFGRID2
keywords: scfconv7
keywords: smallprint printgap noloewdin
keywords: NOSOSCF
formula: C22H19Cl2NO3
InChI: InChI=1/C22H19Cl2NO3/c1-22(2)17(12-19(23)24)20(22)21(26)28-18(13-25)14-7-6-10-16(11-14)27-15-8-4-3-5-9-15/h3-12,17-18,20H,1-2H3
47 atoms
Cl 0.870915 -3.820262 -2.207434
Cl 3.66972 -4.444146 -2.539233
O  -1.168856 -0.477436 -0.787076
O  -1.143046 -1.80637 1.021657
O  -1.199766 4.244243 0.816849
N  -3.650335 -0.616757 -3.001887
C  1.911327 -1.061526 0.986683
C  1.717464 -2.426423 0.417417
C  0.894034 -1.28317 -0.124038
C  1.462023 -0.792271 2.401105
C  3.128394 -0.263007 0.583944
C  2.737093 -3.065708 -0.443168
C  -0.555909 -1.251362 0.136464
C  2.460907 -3.691519 -1.579656
C  -2.555489 -0.257637 -0.655698
C  -2.86073 1.136377 -0.139863
C  -3.14859 -0.455149 -1.981753
C  -1.845183 2.0404 0.1198
C  -4.188304 1.496673 0.061295
C  -2.165494 3.310184 0.588411
C  -4.492363 2.768414 0.513832
C  -3.484978 3.681738 0.786042
C  -0.049388 3.856202 1.445417
C  -0.086985 3.191948 2.665616
C  1.162441 4.187333 0.858884
C  1.101793 2.868132 3.299577
C  2.345854 3.857182 1.504307
C  2.321801 3.194613 2.722546
H  1.160434 -3.114528 1.049328
H  1.182784 -0.894229 -1.093459
H  2.288741 -0.987799 3.08667
H  0.62358 -1.412206 2.708269
H  1.175885 0.253401 2.520977
H  3.975936 -0.504422 1.228788
H  2.929809 0.805065 0.68665
H  3.431311 -0.449968 -0.446756
H  3.770552 -3.051289 -0.11699
H  -2.997017 -0.996855 0.022151
H  -0.809772 1.779211 -0.052414
H  -4.984695 0.792759 -0.147001
H  -5.525039 3.051691 0.665888
H  -3.714982 4.676312 1.144195
H  -1.036573 2.939962 3.120872
H  1.172789 4.707365 -0.090055
H  1.072304 2.359692 4.254537
H  3.291262 4.119747 1.047874
H  3.245898 2.939035 3.223208
totalener: -2050.65803885 hartree
nucrepener: 2839.61176841 hartree
electener: -4890.26980727 hartree
oneelecener: -8454.28445190 hartree
twoeener: 3564.01464463 hartree
kineticenergy: 2044.53356482 hartree
xcener: -151.873119552589 hartree
chargesum: -0.0000000
charge: -0.025479 -0.039079 -0.281797 -0.368069 -0.300196 -0.000317 0.157866 -0.021491 -0.182602 -0.244854 -0.279248 -0.249906 0.359650 0.092235 0.316632 0.061615 -0.250067 -0.117750 -0.207866 0.160237 -0.088510 -0.183257 0.194609 -0.113107 -0.187777 -0.136895 -0.096868 -0.167052 0.109637 0.109160 0.088008 0.107539 0.069415 0.093472 0.091583 0.092361 0.118738 0.137147 0.131985 0.120528 0.128908 0.130636 0.134512 0.131510 0.141988 0.131815 0.130400
qa: -0.0255 -0.0391 -0.2818 -0.3681 -0.3002 -0.0003 0.1579 -0.0215 -0.1826 -0.2449 -0.2792 -0.2499 0.3597 0.0922 0.3166 0.0616 -0.2501 -0.1177 -0.2079 0.1602 -0.0885 -0.1833 0.1946 -0.1131 -0.1878 -0.1369 -0.0969 -0.1671 0.1096 0.1092 0.0880 0.1075 0.0694 0.0935 0.0916 0.0924 0.1187 0.1371 0.1320 0.1205 0.1289 0.1306 0.1345 0.1315 0.1420 0.1318 0.1304
va: 1.3077 1.2668 2.0931 2.1394 2.0997 3.1175 3.6712 3.8765 3.8873 3.8815 3.9229 3.9111 4.1597 4.2064 3.7657 3.7023 3.9941 3.9097 4.0502 3.8885 3.9544 4.0297 3.8479 3.8995 4.0132 3.8785 3.8737 3.8920 1.0248 1.0260 1.0041 1.0244 1.0215 1.0013 1.0129 1.0028 1.0171 1.0291 1.0185 1.0118 0.9991 1.0105 1.0042 1.0108 0.9949 0.9970 1.0007
dispcorr: -0.027325047 hartree
energy: -2050.685363898790
dipole: 2.95394 -1.74233 1.21161 27.09368 -26.27981 0.81387 27.78525 -26.07990 1.70535
magnitude: 2.24468 au
magnitude: 5.70552 debye
