program: Gaussian 09
title: 000074464
version: EM64L-G09RevD.01
frameworkgroup: C1[X(C13H13N3O3)]
method: RPBEPBE
basis: SDD
operation: Freq
keyword: #p
keyword: freq=noraman
keyword: PBEPBE/SDD
title: #p freq=noraman PBEPBE/SDD
converged: YES YES NO NO
title: Mulliken charges:
elementType: O O O N N N C C C C C C C C C C C C C H H H H H H H H H H H H H
charge: -0.265153 -0.288924 -0.240810 -0.142833 -0.391043 -0.395132 0.412147 0.459424 -0.368561 -0.365349 -0.424039 -0.368425 -0.263306 0.028748 -0.642669 -0.644170 0.140153 0.162537 0.139724 0.243913 0.243688 0.234744 0.329488 0.253750 0.224222 0.244405 0.244301 0.223021 0.246530 0.246447 0.362518 0.360651
chargesum: 0.00000
title: Mulliken charges with hydrogens summed into heavy atoms:
elementType: O O O N N N C C C C C C C C C C C C C
charge: -0.265153 -0.288924 -0.240810 -0.142833 -0.028525 -0.034481 0.412147 0.459424 -0.124647 -0.121661 -0.189295 -0.038937 -0.009556 0.028748 0.070260 0.071828 0.140153 0.162537 0.139724
polarizability: 4.50225946e+02 1.67899214e+00 1.71237468e+02 -2.27088717e-02 1.64061433e-02 7.70890113e+01
1716.lowfreq: -8.2275 -6.2344 -0.0006 -0.0004 0.0007 7.0321 26.2223 39.4082 60.0584
frequency: 26.0603 39.3088 60.0180 82.9707 87.9537 121.0975 149.3954 154.8274 164.3322 182.5141 183.8039 205.7304 250.5261 278.8015 341.0121 362.9400 393.9017 401.9719 409.2596 459.8918 467.6662 496.7389 503.2874 535.6534 553.7641 601.8692 635.2559 638.1749 646.5930 684.4438 718.8853 734.3677 751.8995 755.2061 782.5618 790.0016 809.4211 847.3550 866.9219 937.7229 958.2823 992.8935 1002.6138 1009.2428 1032.7308 1052.2100 1058.7879 1098.9765 1111.7680 1139.5364 1164.4342 1188.3996 1209.3021 1237.2433 1249.9533 1309.2144 1341.9278 1359.7259 1360.6256 1368.8177 1381.1473 1389.1149 1428.0964 1433.3315 1455.1188 1465.1237 1466.1538 1479.2690 1487.9820 1500.9623 1521.4528 1530.8259 1552.8232 1591.6425 1631.8078 1636.4408 1672.5887 2958.9369 2965.7961 3031.4827 3036.3959 3060.8541 3106.5166 3117.1336 3126.1450 3147.4176 3167.5211 3171.0097 3537.1360 3541.8003
redmass: 5.6402 3.9083 4.1888 2.5307 5.6132 1.3432 3.2720 5.9446 10.8277 1.2837 6.4528 5.9494 3.2601 4.2001 5.3161 12.1730 5.1141 7.2229 3.1529 3.3950 4.0446 8.8192 4.5122 2.3320 5.1136 8.3571 7.0726 2.2380 6.5184 2.2130 4.9767 1.9521 3.1293 2.6199 5.8413 4.1662 1.3635 1.5759 5.9765 3.1189 1.3383 3.0816 3.3509 1.4481 1.3004 1.5709 4.5747 1.2368 1.3371 1.6832 1.6927 5.6049 1.5087 1.8387 2.6771 2.1604 1.6585 2.2151 1.7815 2.5092 4.9676 4.7584 1.3195 1.5444 1.2559 1.0402 2.8725 1.0452 1.2036 1.1682 3.0710 3.7597 5.8430 5.7559 6.3399 6.0773 5.4897 1.0364 1.0384 1.1006 1.1024 1.0854 1.0977 1.0955 1.0893 1.0917 1.0933 1.0945 1.0767 1.0776
irintensity: 0.9997 0.1199 0.0013 0.1810 0.2784 3.1612 3.4233 0.0885 6.4088 0.0073 0.2946 2.7330 3.6249 3.5443 0.8405 26.7936 18.8859 0.4377 1.9909 1.2527 12.1170 29.1055 64.1984 22.7304 4.0951 0.5003 3.0721 1.0221 6.9107 42.1172 5.5653 2.6001 44.1351 48.0168 1.8966 131.1920 25.6751 63.3972 13.6737 38.7254 0.4107 0.1656 0.4959 8.5292 4.5782 20.6904 8.1397 0.0332 0.8984 30.3518 22.5887 39.7066 490.0859 23.9041 26.2016 177.8715 77.9236 15.4499 98.0082 312.2899 102.1490 148.0207 104.0414 369.9492 53.7292 0.2071 37.3555 25.8084 25.0352 19.7354 881.3054 201.7150 555.8466 378.1664 71.5949 581.5001 691.2241 78.2420 139.1227 15.4335 47.0789 2.7630 3.3611 41.4729 4.5094 26.2936 13.3715 31.7860 78.7120 90.0228
temp: 298.150 k
press: 1.00000 atm
elementType: 8 8 8 7 7 7 6 6 6 6 6 6 6 6 6 6 6 6 6 1 1 1 1 1 1 1 1 1 1 1 1 1
symmnumber: 1
zpe: 645701.2 jmol-1
zpe.correction: 0.245935 hartree
zpe.thermalcorrener: 0.263114 hartree
zpe.thermalcorrenthalpy: 0.264058 hartree
zpe.thermalcorrgfe: 0.199801 hartree
zpe.sumelectzpe: -891.793628 hartree
zpe.sumelectthermal: -891.776448 hartree
zpe.sumelectthermalent: -891.775504 hartree
zpe.sumelectthermalfe: -891.839761 hartree
dipole: -10.5545 -0.2574 0.0056
dipole: 10.5576
quadrupole: -90.0655 -112.5205 -113.5402
quadrupole: 2.4448 -0.0259 -0.0663
quadrupole: 15.3099 -7.1451 -8.1648 2.4448 -0.0259 -0.0663
hfenergy: -892.0395622 hartree
pointgroup: C01 [X(C13H13N3O3)]
dipole: 4.1488299 0.0989784 -0.1750134 debye
polarizability: 449.0462988|7.8735884|96.2258076|-18.0742452|37.4155317|153.2803189 unknown
InChI: InChI=1S/C13H13N3O3/c1-16(2)9-5-3-8(4-6-9)7-10-11(17)14-13(19)15-12(10)18/h3-7,14-15H,1-2H3
charge 0 multiplicity 1
32 atoms
O  -3.035302 -1.158673 -2.051891
O  -1.275344 0.958099 1.985165
O  -5.828257 0.409706 1.317514
N  4.946663 0.230941 -0.01722
N  -4.378561 -0.362152 -0.352256
N  -3.513325 0.64248 1.578461
C  3.574413 0.094878 -0.163669
C  0.705021 -0.18172 -0.457655
C  3.006814 -0.516922 -1.334853
C  2.665177 0.560712 0.848616
C  1.624568 -0.644348 -1.464468
C  1.282943 0.428514 0.707984
C  -0.692508 -0.389083 -0.74219
C  -1.924147 -0.134646 -0.121102
C  5.859352 -0.251795 -1.067987
C  5.507037 0.857076 1.193352
C  -3.103776 -0.591041 -0.920153
C  -2.155119 0.511036 1.184104
C  -4.659466 0.241629 0.879856
H  3.652037 -0.888465 -2.134988
H  3.051723 1.032389 1.756062
H  1.219862 -1.115945 -2.368851
H  0.60973 0.790981 1.489603
H  -0.861404 -0.884731 -1.713355
H  6.898992 -0.046879 -0.771103
H  5.672763 0.257246 -2.033613
H  5.757206 -1.34324 -1.226017
H  6.60526 0.868207 1.123551
H  5.227054 0.297124 2.106541
H  5.159924 1.902236 1.307819
H  -5.185273 -0.673238 -0.900595
H  -3.672256 1.091322 2.485238
