program: Orca
programVersion: 5.0.2
elementType: Cl Cl O O O N C C C C C C C C C C C C C C C C C C C C C C H H H H H H H H H H H H H H H H H H H
charge: 0
multiplicity: 1
keywords: wb97x-d3
keywords: def2-TZVPP
keywords: def2/J RIJCOSX
keywords: DEFGRID2
keywords: scfconv7
keywords: smallprint printgap noloewdin
keywords: NOSOSCF
formula: C22H19Cl2NO3
InChI: InChI=1/C22H19Cl2NO3/c1-22(2)17(12-19(23)24)20(22)21(26)28-18(13-25)14-7-6-10-16(11-14)27-15-8-4-3-5-9-15/h3-12,17-18,20H,1-2H3
47 atoms
Cl 2.339288 -5.531329 1.351434
Cl 1.811074 -7.220844 -0.924213
O  -1.522514 -0.997509 -0.665269
O  0.051123 -0.993854 0.927279
O  -0.050212 4.023883 1.345441
N  -4.793505 -0.552328 -0.502209
C  1.845723 -2.032538 -1.426753
C  1.447223 -3.180311 -0.547064
C  0.383075 -2.243597 -1.087863
C  2.628367 -0.904065 -0.799397
C  2.226233 -2.282094 -2.867009
C  1.467549 -4.573055 -1.01091
C  -0.334463 -1.359754 -0.148581
C  1.823836 -5.62559 -0.284153
C  -2.295746 -0.075153 0.096788
C  -1.904803 1.346382 -0.223346
C  -3.692211 -0.348814 -0.248217
C  -1.184304 2.07925 0.706736
C  -2.229815 1.902245 -1.455451
C  -0.789955 3.376859 0.406682
C  -1.826568 3.194007 -1.745156
C  -1.105038 3.938406 -0.824012
C  -0.179013 5.374881 1.509211
C  -1.422737 5.990374 1.576847
C  0.983955 6.112897 1.668151
C  -1.490858 7.356711 1.799224
C  0.900318 7.477436 1.90008
C  -0.334264 8.105849 1.960939
H  1.669965 -3.037822 0.504127
H  -0.227676 -2.617912 -1.901532
H  3.696043 -1.102306 -0.904329
H  2.417585 -0.774914 0.25867
H  2.416659 0.041223 -1.302029
H  3.262746 -2.614708 -2.938478
H  2.130913 -1.361244 -3.443811
H  1.603742 -3.031606 -3.354134
H  1.161119 -4.775717 -2.029606
H  -2.173258 -0.263793 1.167633
H  -0.913213 1.649261 1.662552
H  -2.801363 1.336875 -2.180486
H  -2.074445 3.632338 -2.702395
H  -0.792632 4.94619 -1.064362
H  -2.329815 5.410378 1.464058
H  1.943088 5.614637 1.616844
H  -2.459014 7.836415 1.854631
H  1.808755 8.051086 2.027474
H  -0.396016 9.170959 2.137687
totalener: -2050.66181916 hartree
nucrepener: 2651.98100356 hartree
electener: -4702.64282272 hartree
oneelecener: -8079.18782320 hartree
twoeener: 3376.54500048 hartree
kineticenergy: 2044.53189412 hartree
xcener: -151.870318491191 hartree
chargesum: -0.0000000
charge: -0.038297 -0.044049 -0.259399 -0.381515 -0.295483 -0.002089 0.065667 0.041452 -0.092704 -0.247354 -0.247340 -0.202634 0.365115 0.051271 0.315901 0.001792 -0.258103 -0.150708 -0.166423 0.191477 -0.117141 -0.144003 0.230203 -0.156482 -0.202099 -0.117618 -0.095289 -0.139050 0.087235 0.082648 0.090228 0.102617 0.089619 0.100035 0.094738 0.074091 0.096677 0.120404 0.120939 0.122694 0.131889 0.135915 0.135434 0.126903 0.128943 0.126769 0.127124
qa: -0.0383 -0.0440 -0.2594 -0.3815 -0.2955 -0.0021 0.0657 0.0415 -0.0927 -0.2474 -0.2473 -0.2026 0.3651 0.0513 0.3159 0.0018 -0.2581 -0.1507 -0.1664 0.1915 -0.1171 -0.1440 0.2302 -0.1565 -0.2021 -0.1176 -0.0953 -0.1391 0.0872 0.0826 0.0902 0.1026 0.0896 0.1000 0.0947 0.0741 0.0967 0.1204 0.1209 0.1227 0.1319 0.1359 0.1354 0.1269 0.1289 0.1268 0.1271
va: 1.2890 1.2610 2.1349 2.1221 2.1090 3.1178 3.7607 3.8307 3.8687 3.9159 3.9097 3.9222 4.2317 4.2539 3.8283 3.6727 4.0248 4.0247 4.0379 3.9112 3.9598 3.9440 3.8100 3.9418 4.0354 3.9480 3.9378 3.9568 1.0492 1.0352 1.0014 1.0206 1.0016 1.0023 1.0039 1.0103 1.0313 1.0194 1.0323 1.0160 1.0008 1.0026 1.0025 1.0131 0.9996 0.9988 1.0000
dispcorr: -0.022759197 hartree
energy: -2050.684578360912
dipole: 1.73751 -0.57023 1.16728 43.33408 -41.91711 1.41697 -9.55707 8.73656 -0.82052
magnitude: 2.01087 au
magnitude: 5.11123 debye
