program: Orca
programVersion: 5.0.2
elementType: Cl Cl O O O N C C C C C C C C C C C C C C C C C C C C C C H H H H H H H H H H H H H H H H H H H
charge: 0
multiplicity: 1
keywords: wb97x-d3
keywords: def2-TZVPP
keywords: def2/J RIJCOSX
keywords: DEFGRID2
keywords: scfconv7
keywords: smallprint printgap noloewdin
keywords: NOSOSCF
formula: C22H19Cl2NO3
InChI: InChI=1/C22H19Cl2NO3/c1-22(2)17(12-19(23)24)20(22)21(26)28-18(13-25)14-7-6-10-16(11-14)27-15-8-4-3-5-9-15/h3-12,17-18,20H,1-2H3
47 atoms
Cl 2.608286 -5.433359 1.360639
Cl 1.933584 -7.260825 -0.765883
O  -1.565821 -1.05821 -0.626218
O  0.05855 -1.017614 0.912492
O  -0.187176 4.079104 1.477226
N  -4.797532 -0.344556 -0.518128
C  1.746658 -2.111904 -1.503224
C  1.429927 -3.223025 -0.545587
C  0.312236 -2.34246 -1.066763
C  2.530939 -0.932251 -0.980569
C  2.054776 -2.427765 -2.947594
C  1.46601 -4.636071 -0.943799
C  -0.36583 -1.419412 -0.13511
C  1.940312 -5.634573 -0.208579
C  -2.276439 -0.070706 0.111334
C  -1.784696 1.316743 -0.22119
C  -3.685196 -0.23679 -0.253859
C  -1.218389 2.099325 0.771077
C  -1.886702 1.795378 -1.522612
C  -0.758823 3.374336 0.465485
C  -1.41283 3.061289 -1.818145
C  -0.846468 3.857404 -0.833575
C  -0.311551 5.440911 1.508859
C  -1.539933 6.066212 1.333472
C  0.82705 6.184279 1.77793
C  -1.616628 7.44691 1.422425
C  0.73375 7.564613 1.875036
C  -0.483848 8.201918 1.692098
H  1.709734 -3.022352 0.48224
H  -0.335624 -2.768918 -1.824241
H  3.596272 -1.109082 -1.135668
H  2.376245 -0.750949 0.079741
H  2.265149 -0.021153 -1.519356
H  3.096951 -2.730797 -3.05861
H  1.896996 -1.543808 -3.566793
H  1.434095 -3.223138 -3.358142
H  1.070352 -4.902861 -1.91587
H  -2.185619 -0.251542 1.186916
H  -1.120559 1.727567 1.783131
H  -2.337882 1.189358 -2.297804
H  -1.483919 3.440143 -2.828781
H  -0.479088 4.845149 -1.079262
H  -2.429561 5.482437 1.1340
H  1.774244 5.679828 1.915878
H  -2.573219 7.933875 1.286727
H  1.622497 8.143548 2.088286
H  -0.55213 9.278827 1.763488
totalener: -2050.66145741 hartree
nucrepener: 2653.03561335 hartree
electener: -4703.69707076 hartree
oneelecener: -8081.29176041 hartree
twoeener: 3377.59468965 hartree
kineticenergy: 2044.53164229 hartree
xcener: -151.870049681076 hartree
chargesum: 0.0000000
charge: -0.038425 -0.044014 -0.262298 -0.373180 -0.295940 -0.000589 0.065202 0.043226 -0.088636 -0.244229 -0.246077 -0.203742 0.347680 0.050893 0.318126 0.013599 -0.258032 -0.146445 -0.179893 0.188593 -0.115680 -0.139476 0.223764 -0.152568 -0.198772 -0.118571 -0.096811 -0.137617 0.087289 0.082795 0.089816 0.102462 0.089024 0.099987 0.094308 0.073943 0.097019 0.119016 0.115946 0.124373 0.131377 0.135750 0.135878 0.127278 0.129227 0.126933 0.127488
qa: -0.0384 -0.0440 -0.2623 -0.3732 -0.2959 -0.0006 0.0652 0.0432 -0.0886 -0.2442 -0.2461 -0.2037 0.3477 0.0509 0.3181 0.0136 -0.2580 -0.1464 -0.1799 0.1886 -0.1157 -0.1395 0.2238 -0.1526 -0.1988 -0.1186 -0.0968 -0.1376 0.0873 0.0828 0.0898 0.1025 0.0890 0.1000 0.0943 0.0739 0.0970 0.1190 0.1159 0.1244 0.1314 0.1358 0.1359 0.1273 0.1292 0.1269 0.1275
va: 1.2888 1.2610 2.1340 2.1331 2.1080 3.1195 3.7665 3.8315 3.8648 3.9149 3.9090 3.9207 4.2505 4.2526 3.8357 3.6555 4.0234 4.0407 4.0303 3.9205 3.9580 3.9343 3.8162 3.9428 4.0335 3.9476 3.9370 3.9554 1.0498 1.0352 1.0016 1.0204 1.0019 1.0026 1.0042 1.0101 1.0308 1.0196 1.0292 1.0169 1.0007 1.0028 1.0022 1.0127 0.9996 0.9988 0.9999
dispcorr: -0.022952670 hartree
energy: -2050.684410082707
dipole: 0.29392 0.87160 1.16552 42.56212 -41.27118 1.29094 -11.21546 10.34028 -0.87518
magnitude: 1.94702 au
magnitude: 4.94894 debye
