program: Orca
programVersion: 5.0.2
elementType: Cl Cl O O O N C C C C C C C C C C C C C C C C C C C C C C H H H H H H H H H H H H H H H H H H H
charge: 0
multiplicity: 1
keywords: wb97x-d3
keywords: def2-TZVPP
keywords: def2/J RIJCOSX
keywords: DEFGRID2
keywords: scfconv7
keywords: smallprint printgap noloewdin
keywords: NOSOSCF
formula: C22H19Cl2NO3
InChI: InChI=1/C22H19Cl2NO3/c1-22(2)17(12-19(23)24)20(22)21(26)28-18(13-25)14-7-6-10-16(11-14)27-15-8-4-3-5-9-15/h3-12,17-18,20H,1-2H3
47 atoms
Cl 0.878894 -6.148996 -1.394406
Cl 3.633544 -5.663176 -2.099147
O  -0.418255 0.080898 -0.860762
O  -1.578703 -1.783623 -0.42171
O  -2.019954 4.275173 2.208772
N  -0.937847 2.534048 -3.006482
C  1.052877 -2.525904 1.137461
C  0.970091 -3.26347 -0.166297
C  0.798218 -1.758042 -0.144522
C  -0.053619 -2.742398 2.140599
C  2.399649 -2.302885 1.784004
C  2.149805 -3.847516 -0.81652
C  -0.530425 -1.199909 -0.472256
C  2.204799 -5.057778 -1.359497
C  -1.624139 0.752519 -1.222599
C  -2.296705 1.378293 -0.025338
C  -1.229867 1.75018 -2.219513
C  -1.79796 2.560839 0.51344
C  -3.391335 0.747657 0.544175
C  -2.415257 3.116796 1.624437
C  -3.996161 1.313299 1.658454
C  -3.516763 2.48929 2.200551
C  -0.902963 4.919838 1.741513
C  0.341871 4.589438 2.254219
C  -1.040528 5.919433 0.791895
C  1.461427 5.278907 1.813512
C  0.086049 6.602211 0.358077
C  1.337143 6.28393 0.865289
H  0.045398 -3.810001 -0.311772
H  1.632311 -1.161662 -0.496874
H  -1.00736 -2.982232 1.678014
H  -0.193211 -1.855208 2.76083
H  0.212944 -3.569148 2.800767
H  2.712929 -3.194453 2.329284
H  2.344597 -1.478541 2.496168
H  3.185305 -2.060308 1.06954
H  3.055956 -3.256559 -0.865657
H  -2.315305 0.055245 -1.705717
H  -0.948077 3.050762 0.054074
H  -3.765528 -0.177912 0.129084
H  -4.852841 0.829943 2.108456
H  -3.989338 2.936623 3.065126
H  0.427809 3.806999 2.997126
H  -2.021002 6.161788 0.403292
H  2.434764 5.029065 2.214175
H  -0.016637 7.384288 -0.382111
H  2.21273 6.819419 0.52443
totalener: -2050.66208721 hartree
nucrepener: 2697.94841755 hartree
electener: -4748.61050476 hartree
oneelecener: -8171.30324579 hartree
twoeener: 3422.69274103 hartree
kineticenergy: 2044.53142485 hartree
xcener: -151.869987787145 hartree
chargesum: 0.0000000
charge: -0.039053 -0.043951 -0.257794 -0.385794 -0.294183 -0.003693 0.066318 0.041884 -0.100481 -0.247016 -0.242959 -0.204909 0.368155 0.052927 0.317853 -0.028567 -0.264671 -0.161599 -0.141529 0.234814 -0.090067 -0.198350 0.185181 -0.143617 -0.139025 -0.127379 -0.118720 -0.110747 0.087820 0.083571 0.100847 0.089454 0.090393 0.100291 0.094149 0.073080 0.098652 0.124118 0.122112 0.121209 0.127004 0.126658 0.125445 0.127679 0.127161 0.128781 0.128548
qa: -0.0391 -0.0440 -0.2578 -0.3858 -0.2942 -0.0037 0.0663 0.0419 -0.1005 -0.2470 -0.2430 -0.2049 0.3682 0.0529 0.3179 -0.0286 -0.2647 -0.1616 -0.1415 0.2348 -0.0901 -0.1983 0.1852 -0.1436 -0.1390 -0.1274 -0.1187 -0.1107 0.0878 0.0836 0.1008 0.0895 0.0904 0.1003 0.0941 0.0731 0.0987 0.1241 0.1221 0.1212 0.1270 0.1267 0.1254 0.1277 0.1272 0.1288 0.1285
va: 1.2881 1.2615 2.1363 2.1174 2.1177 3.1165 3.7625 3.8198 3.8819 3.9158 3.9091 3.9227 4.2268 4.2499 3.8258 3.7299 4.0326 3.9782 3.9823 3.8646 3.9613 4.0346 3.8663 3.9993 4.0069 3.9509 3.9545 3.9394 1.0506 1.0349 1.0207 1.0016 1.0015 1.0027 1.0044 1.0101 1.0294 1.0167 1.0227 1.0225 0.9996 1.0136 1.0078 1.0081 0.9999 1.0000 0.9997
dispcorr: -0.023253794 hartree
energy: -2050.685341007137
dipole: -5.51561 5.87179 0.35618 28.72421 -28.56796 0.15625 23.31403 -21.85642 1.45761
magnitude: 1.50861 au
magnitude: 3.83458 debye
