program: Orca
programVersion: 5.0.2
elementType: Cl Cl O O O N C C C C C C C C C C C C C C C C C C C C C C H H H H H H H H H H H H H H H H H H H
charge: 0
multiplicity: 1
keywords: wb97x-d3
keywords: def2-TZVPP
keywords: def2/J RIJCOSX
keywords: DEFGRID2
keywords: scfconv7
keywords: smallprint printgap noloewdin
keywords: NOSOSCF
formula: C22H19Cl2NO3
InChI: InChI=1/C22H19Cl2NO3/c1-22(2)17(12-19(23)24)20(22)21(26)28-18(13-25)14-7-6-10-16(11-14)27-15-8-4-3-5-9-15/h3-12,17-18,20H,1-2H3
47 atoms
Cl 0.552398 -4.292621 1.078693
Cl 2.606704 -6.029516 0.031305
O  -1.428832 -0.96215 -0.414172
O  0.160507 -0.10185 0.906563
O  -1.399898 4.583834 0.412532
N  -4.639536 -1.563514 0.078949
C  2.043797 -1.058352 -1.415486
C  2.097237 -1.998466 -0.259961
C  0.754025 -1.622883 -0.838505
C  2.422035 0.386186 -1.197451
C  2.409501 -1.573998 -2.786968
C  2.59366 -3.385617 -0.392405
C  -0.156457 -0.808914 -0.011449
C  1.996952 -4.431072 0.16442
C  -2.416289 -0.207022 0.284396
C  -2.543256 1.182229 -0.291488
C  -3.6578 -0.972922 0.158726
C  -1.9116 2.235904 0.35341
C  -3.239169 1.398804 -1.475082
C  -1.967729 3.509467 -0.198485
C  -3.301879 2.676172 -2.005429
C  -2.662317 3.733633 -1.377727
C  -0.143099 4.494734 0.940197
C  0.112738 5.246765 2.078007
C  0.865598 3.742702 0.351067
C  1.386124 5.249648 2.624174
C  2.132689 3.750117 0.913716
C  2.40165 4.500948 2.047992
H  2.305787 -1.534867 0.701506
H  0.26196 -2.365167 -1.456087
H  1.896751 1.034214 -1.90189
H  3.492161 0.512828 -1.371114
H  2.204036 0.73324 -0.190125
H  2.109482 -2.611227 -2.938168
H  3.488002 -1.513139 -2.945436
H  1.928431 -0.975654 -3.56162
H  3.510777 -3.562201 -0.941997
H  -2.167891 -0.147346 1.348438
H  -1.367939 2.064314 1.273499
H  -3.742096 0.580489 -1.974403
H  -3.848678 2.851721 -2.921896
H  -2.703206 4.732651 -1.791068
H  -0.684406 5.827592 2.522897
H  0.672181 3.156641 -0.537969
H  1.581691 5.838143 3.510712
H  2.917518 3.164881 0.452538
H  3.393335 4.502847 2.479146
totalener: -2050.65939389 hartree
nucrepener: 2809.10868747 hartree
electener: -4859.76808136 hartree
oneelecener: -8393.45659624 hartree
twoeener: 3533.68851488 hartree
kineticenergy: 2044.54433480 hartree
xcener: -151.873114687322 hartree
chargesum: -0.0000000
charge: -0.028594 -0.037777 -0.250657 -0.387259 -0.298852 -0.002111 0.139025 -0.019132 -0.169937 -0.282287 -0.270707 -0.250425 0.394124 0.093934 0.313616 -0.003612 -0.256415 -0.136799 -0.165353 0.206720 -0.100623 -0.189137 0.246743 -0.218042 -0.148112 -0.086115 -0.105486 -0.154892 0.112826 0.107871 0.095221 0.092855 0.092016 0.089809 0.094244 0.097429 0.119403 0.122932 0.135746 0.121723 0.130360 0.129723 0.125349 0.124726 0.125372 0.126219 0.124342
qa: -0.0286 -0.0378 -0.2507 -0.3873 -0.2989 -0.0021 0.1390 -0.0191 -0.1699 -0.2823 -0.2707 -0.2504 0.3941 0.0939 0.3136 -0.0036 -0.2564 -0.1368 -0.1654 0.2067 -0.1006 -0.1891 0.2467 -0.2180 -0.1481 -0.0861 -0.1055 -0.1549 0.1128 0.1079 0.0952 0.0929 0.0920 0.0898 0.0942 0.0974 0.1194 0.1229 0.1357 0.1217 0.1304 0.1297 0.1253 0.1247 0.1254 0.1262 0.1243
va: 1.3053 1.2688 2.1324 2.1064 2.1145 3.1173 3.7043 3.8376 3.9075 3.9077 3.9155 3.9113 4.1449 4.2074 3.8316 3.6692 4.0218 3.9161 4.0360 3.8809 3.9458 4.0482 3.8403 4.0362 3.9292 3.9404 3.9449 3.9975 1.0244 1.0247 0.9968 1.0050 1.0148 1.0011 1.0011 1.0061 1.0170 1.0177 1.0211 1.0164 0.9998 1.0108 1.0142 1.0024 0.9983 0.9981 1.0013
dispcorr: -0.026237870 hartree
energy: -2050.685631763403
dipole: 9.62481 -7.96557 1.65924 34.67135 -33.79676 0.87459 -11.69058 10.89622 -0.79436
magnitude: 2.03691 au
magnitude: 5.17741 debye
