program: Orca
programVersion: 5.0.2
elementType: Cl Cl O O O N C C C C C C C C C C C C C C C C C C C C C C H H H H H H H H H H H H H H H H H H H
charge: 0
multiplicity: 1
keywords: wb97x-d3
keywords: def2-TZVPP
keywords: def2/J RIJCOSX
keywords: DEFGRID2
keywords: scfconv7
keywords: smallprint printgap noloewdin
keywords: NOSOSCF
formula: C22H19Cl2NO3
InChI: InChI=1/C22H19Cl2NO3/c1-22(2)17(12-19(23)24)20(22)21(26)28-18(13-25)14-7-6-10-16(11-14)27-15-8-4-3-5-9-15/h3-12,17-18,20H,1-2H3
47 atoms
Cl 4.451568 -3.617356 -0.454579
Cl 3.509115 -6.34262 -0.387433
O  -1.352003 -1.19532 0.72227
O  0.644161 -0.315675 0.225488
O  -1.269019 4.470456 -0.659309
N  -3.665401 -0.56745 2.996165
C  0.450673 -2.48219 -2.064617
C  1.445696 -2.887685 -1.016994
C  0.048333 -2.483025 -0.601597
C  0.685956 -1.181767 -2.793902
C  -0.204646 -3.533328 -2.928579
C  1.869705 -4.281443 -0.83341
C  -0.138777 -1.219887 0.138993
C  3.111518 -4.6827 -0.590179
C  -1.707417 0.019148 1.369065
C  -2.138012 1.073206 0.376674
C  -2.80457 -0.324147 2.276274
C  -1.489437 2.296598 0.350688
C  -3.168535 0.800386 -0.515571
C  -1.89086 3.265337 -0.562516
C  -3.544243 1.765047 -1.434049
C  -2.916234 3.001027 -1.457912
C  -0.879371 5.127457 0.475147
C  0.366579 5.735747 0.464873
C  -1.712007 5.238608 1.581619
C  0.777711 6.466799 1.569037
C  -1.283834 5.965096 2.681927
C  -0.040811 6.58134 2.682406
H  2.204071 -2.142424 -0.80626
H  -0.631996 -3.276387 -0.312443
H  1.221342 -0.448102 -2.196831
H  -0.260274 -0.735467 -3.10488
H  1.274374 -1.370868 -3.692853
H  -0.463744 -4.439951 -2.383087
H  0.453102 -3.818536 -3.750933
H  -1.127215 -3.142707 -3.360005
H  1.117861 -5.058662 -0.892526
H  -0.875195 0.394478 1.973204
H  -0.667285 2.491826 1.02798
H  -3.678316 -0.154209 -0.490756
H  -4.346194 1.562052 -2.130904
H  -3.213431 3.762215 -2.167045
H  1.000997 5.638972 -0.406076
H  -2.688239 4.77066 1.584621
H  1.748813 6.943534 1.558258
H  -1.933306 6.05393 3.542586
H  0.28509 7.149565 3.542918
totalener: -2050.66115626 hartree
nucrepener: 2690.74319679 hartree
electener: -4741.40435305 hartree
oneelecener: -8156.71411212 hartree
twoeener: 3415.30975907 hartree
kineticenergy: 2044.53879587 hartree
xcener: -151.871102657055 hartree
chargesum: 0.0000000
charge: -0.038448 -0.044302 -0.261543 -0.367525 -0.298619 0.000132 0.065400 0.042674 -0.081042 -0.242808 -0.245728 -0.204848 0.333799 0.052079 0.316438 0.020778 -0.257562 -0.100600 -0.197915 0.187314 -0.096259 -0.183279 0.222635 -0.202706 -0.149482 -0.091686 -0.119002 -0.141816 0.086719 0.082731 0.101819 0.087687 0.090959 0.073764 0.100910 0.093677 0.096947 0.119284 0.119366 0.123899 0.130012 0.130382 0.126947 0.134512 0.126819 0.129892 0.127591
qa: -0.0384 -0.0443 -0.2615 -0.3675 -0.2986 0.0001 0.0654 0.0427 -0.0810 -0.2428 -0.2457 -0.2048 0.3338 0.0521 0.3164 0.0208 -0.2576 -0.1006 -0.1979 0.1873 -0.0963 -0.1833 0.2226 -0.2027 -0.1495 -0.0917 -0.1190 -0.1418 0.0867 0.0827 0.1018 0.0877 0.0910 0.0738 0.1009 0.0937 0.0969 0.1193 0.1194 0.1239 0.1300 0.1304 0.1269 0.1345 0.1268 0.1299 0.1276
va: 1.2890 1.2608 2.1326 2.1394 2.1083 3.1200 3.7708 3.8327 3.8521 3.9133 3.9075 3.9230 4.2659 4.2523 3.8439 3.6307 4.0221 3.9231 4.0236 3.8946 3.9402 4.0335 3.8202 4.0368 3.9390 3.9359 3.9528 3.9602 1.0510 1.0347 1.0200 1.0028 1.0016 1.0100 1.0024 1.0044 1.0306 1.0202 1.0190 1.0179 0.9990 1.0107 1.0133 1.0035 0.9986 0.9995 1.0000
dispcorr: -0.023395140 hartree
energy: -2050.684551401649
dipole: -20.89621 20.90054 0.00434 27.00547 -26.59179 0.41368 -10.33056 9.14009 -1.19047
magnitude: 1.26030 au
magnitude: 3.20343 debye
