program: Gaussian 09
title: 000074428
version: EM64L-G09RevD.01
frameworkgroup: C1[X(C10H8O4S)]
method: RPBEPBE
basis: SDD
operation: Freq
keyword: #p
keyword: freq=noraman
keyword: PBEPBE/SDD
title: #p freq=noraman PBEPBE/SDD
converged: YES YES NO NO
title: Mulliken charges:
elementType: S O O O O C C C C C C C C C C H H H H H H H H
charge: 1.108123 -0.398830 -0.561029 -0.465437 -0.477551 0.398110 0.390153 -0.510876 0.295137 -0.371124 -0.381262 -0.399199 -0.340910 -0.233901 -0.220458 0.273678 0.246497 0.251319 0.267209 0.250221 0.241248 0.239465 0.399414
chargesum: 0.00000
title: Mulliken charges with hydrogens summed into heavy atoms:
elementType: S O O O O C C C C C C C C C C
charge: 1.108123 -0.398830 -0.161614 -0.465437 -0.477551 0.398110 0.390153 -0.237198 0.295137 -0.124626 -0.129942 -0.148978 -0.073701 0.007347 0.019007
polarizability: 3.98862404e+02 4.60069458e+00 1.44906951e+02 7.60266501e-01 -2.29606264e+00 8.83465468e+01
1716.lowfreq: -11.8535 -7.4529 -0.0018 -0.0017 0.0001 2.7143 16.1944 26.8809 43.1877
frequency: 15.9752 26.7357 43.1655 92.0465 109.9315 145.7884 183.3337 200.3452 248.7578 285.8328 301.7095 317.1203 340.8542 388.0679 408.4529 427.1335 463.7463 475.2398 513.7216 530.3812 548.2835 616.9193 656.3379 720.3314 752.0101 767.4575 775.5716 825.7299 844.6193 883.7947 896.9022 918.0604 945.5247 947.9306 968.9070 983.5839 999.6671 1023.2808 1091.2625 1118.3159 1149.4514 1171.9837 1178.2377 1238.0802 1263.4300 1276.2548 1341.5895 1405.7924 1413.3473 1441.9038 1447.5705 1497.2021 1550.8334 1588.3733 1623.1516 3131.5239 3136.7279 3137.6509 3151.7422 3152.7515 3170.8149 3175.1336 3450.0790
redmass: 10.1574 6.9884 7.3220 7.4475 7.7885 6.1185 3.7667 6.0580 3.3405 3.0809 4.8229 2.7963 6.2281 5.3320 4.3605 6.5199 3.9960 3.3332 6.4161 4.4390 8.7039 6.7303 2.6013 5.9444 4.8421 1.3722 2.6749 1.3811 10.5589 1.5701 4.7297 1.6988 8.8541 4.5148 1.3894 1.3838 1.3720 2.2999 1.1682 1.7609 1.2535 1.6152 1.1453 2.0455 2.2044 1.7413 2.2015 3.2827 4.9162 1.9788 5.0389 3.3365 6.1996 5.6785 6.5748 1.0866 1.0898 1.0892 1.0927 1.0948 1.1004 1.0967 1.0653
irintensity: 0.6044 1.3893 3.4967 23.8035 5.1281 7.9139 1.8178 42.4803 62.1815 17.1869 2.5569 39.9176 67.0683 28.9940 9.4744 24.2760 17.8019 19.8066 16.3210 44.4849 184.2945 4.8996 0.2657 4.7954 1.1752 57.0859 0.2210 17.2760 104.7728 39.1377 1.8360 25.3351 65.1632 17.2220 5.4479 3.9007 0.2217 0.9371 202.7187 21.7909 14.2662 53.4240 8.7081 3.7637 12.0338 10.9414 8.2790 19.5496 28.4037 31.1555 6.3505 16.5984 30.2306 9.0586 126.8134 1.6637 2.6099 4.9690 1.2583 19.3777 38.7811 4.4505 107.2824
temp: 298.150 k
press: 1.00000 atm
elementType: 16 8 8 8 8 6 6 6 6 6 6 6 6 6 6 1 1 1 1 1 1 1 1
symmnumber: 1
zpe: 412092.3 jmol-1
zpe.correction: 0.156958 hartree
zpe.thermalcorrener: 0.171215 hartree
zpe.thermalcorrenthalpy: 0.172159 hartree
zpe.thermalcorrgfe: 0.113232 hartree
zpe.sumelectzpe: -1083.567427 hartree
zpe.sumelectthermal: -1083.553170 hartree
zpe.sumelectthermalent: -1083.552226 hartree
zpe.sumelectthermalfe: -1083.611153 hartree
dipole: -8.2569 0.7210 2.0201
dipole: 8.5310
quadrupole: -97.0796 -87.3470 -98.1104
quadrupole: 3.6368 10.2314 -0.4630
quadrupole: -2.9006 6.8320 -3.9314 3.6368 10.2314 -0.4630
hfenergy: -1083.7243846 hartree
pointgroup: C01 [X(C10H8O4S1)]
dipole: -3.2089509 -0.3337947 -0.9253761 debye
dipolederiv: 2.0563774 0.0543006 0.0072312 -0.2462433 1.1810498 -0.0332232 -0.1633201 0.0437753 1.4782734 1.0457066 0.0256167 0.3253257 0.1861707 -0.3388972 0.0431183 0.434084 0.0330745 -0.3408301 -1.1538228 0.0425904 0.1957663 0.2285717 -0.5138573 -0.0119753 0.9518242 0.0051984 -0.6880014 -0.9108805 -0.0962695 -0.1169401 -0.4432051 -0.5326592 -0.1183502 -0.5503426 -0.0930055 -0.5310601 -0.7759573 0.0160888 -0.0770986 0.4589147 -0.5180125 0.1796381 -0.5120031 0.0548588 -0.5623664 -0.4578052 -0.144979 -0.0056565 -0.0748154 -0.1275385 0.0269644 0.1466295 0.037703 0.0459884 0.5929636 -0.1132761 0.0281711 0.0210377 -0.0474321 0.0119703 -0.0942241 0.0398697 0.0443955 0.8334226 0.1080901 0.0474723 -0.430922 0.0059153 -0.1480388 -0.2180697 -0.0224926 -0.0907386 -0.9070307 0.0584904 -0.2443887 0.4623631 0.2425326 0.023243 0.3390366 -0.0226771 0.1217147 -0.4407087 0.0788107 -0.0917501 0.1545571 0.1598018 -0.030316 0.0295165 -0.0614421 -0.1081101 0.1056782 0.1674701 -0.0452493 -0.217682 0.0919385 -0.0561689 0.0119788 -0.0528223 -0.1205369 -0.7386982 0.1342805 -0.0542321 0.4158803 0.079674 -0.0324065 0.0290657 -0.0642359 -0.1422712 0.1385418 -0.1048829 0.0099278 0.2027985 -0.0353867 0.078762 -0.0798082 -0.024574 -0.1347747 0.0585765 -0.2322466 0.0150528 -0.1917035 -0.0422876 -0.0067625 -0.0283564 0.0272596 -0.1540232 0.2671279 0.0581132 -0.0620711 -0.3238019 0.1141083 -0.0567267 -0.0228373 -0.0442733 -0.1030219 0.0540419 -0.0059836 0.0140681 -0.0427104 -0.0100091 0.0232352 -0.0123698 0.0190051 0.1386743 0.04226 -0.073859 0.0173981 -0.0381809 -0.0580707 0.0267507 0.0305372 0.0467457 0.1412293 0.0812851 -0.0718823 0.0281856 0.0005179 -0.0493301 0.0348869 0.0135683 0.0407593 0.1431798 0.0307712 0.079082 0.0170943 -0.0051854 0.0538738 -0.0003555 -0.0024696 0.0159278 0.1390171 0.0622036 -0.0031804 0.0126057 -0.0881057 -0.072076 0.0392356 0.0249667 0.0357559 0.1484054 -0.0327813 0.0975308 0.0101035 0.1279653 -0.0067221 0.0097709 0.0146308 0.0048773 0.1607121 -0.1007504 -0.0396725 0.0460767 -0.0459792 0.088852 0.0165897 0.0578376 0.0173149 0.1472816 0.1494786 -0.0342322 -0.0770927 -0.110242 0.3345331 -0.0198414 -0.3998752 -0.0366023 0.2668629 unknown
polarizability: 398.350365|-2.9734758|144.5876907|13.1406922|-4.6928688|89.1778455 unknown
InChI: InChI=1S/C10H7O.HO3S/c11-10-6-5-8-3-1-2-4-9(8)7-10;1-4(2)3/h1-7H;1H
charge 0 multiplicity 1
23 atoms
S  3.620083 0.231764 0.601263
O  2.107839 0.164486 -0.92295
O  4.823531 0.092695 -0.779337
O  3.923373 1.625523 1.35478
O  3.5986 -1.137095 1.462839
C  -1.504822 0.597654 -0.254112
C  -1.886012 -0.780192 0.014756
C  -0.14069 0.897208 -0.520662
C  0.831683 -0.137109 -0.56787
C  -0.87341 -1.80683 -0.005837
C  -2.513606 1.623073 -0.226336
C  -3.252949 -1.073044 0.300789
C  0.451188 -1.504829 -0.286451
C  -3.842335 1.303987 0.058667
C  -4.214164 -0.052542 0.322676
H  0.183146 1.927083 -0.709129
H  -1.169759 -2.840596 0.205562
H  -2.221163 2.659642 -0.429353
H  1.22917 -2.273977 -0.302637
H  -3.54501 -2.10928 0.50587
H  -4.60592 2.088104 0.081108
H  -5.260011 -0.291148 0.543834
H  4.24994 -0.129475 -1.572669
