program: Orca
programVersion: 5.0.2
elementType: Cl Cl O O O N C C C C C C C C C C C C C C C C C C C C C C H H H H H H H H H H H H H H H H H H H
charge: 0
multiplicity: 1
keywords: wb97x-d3
keywords: def2-TZVPP
keywords: def2/J RIJCOSX
keywords: DEFGRID2
keywords: scfconv7
keywords: smallprint printgap noloewdin
keywords: NOSOSCF
formula: C22H19Cl2NO3
InChI: InChI=1/C22H19Cl2NO3/c1-22(2)17(12-19(23)24)20(22)21(26)28-18(13-25)14-7-6-10-16(11-14)27-15-8-4-3-5-9-15/h3-12,17-18,20H,1-2H3
47 atoms
Cl -2.853903 0.715482 -0.64046
Cl -5.023135 -1.029933 -1.400861
O  1.380659 -1.656319 0.03889
O  1.523903 -3.633139 -0.975608
O  1.791439 3.217432 1.273494
N  2.940031 -1.056866 -2.917118
C  -1.058854 -2.831943 1.490334
C  -1.465198 -1.913003 0.376462
C  -0.509919 -3.064494 0.094746
C  -0.196521 -2.264459 2.591684
C  -2.02051 -3.884539 1.989762
C  -2.797551 -1.952769 -0.236304
C  0.880288 -2.840135 -0.332038
C  -3.457556 -0.895619 -0.693137
C  2.715743 -1.358802 -0.326351
C  3.123772 -0.072518 0.350691
C  2.817416 -1.206099 -1.783212
C  2.216868 0.976668 0.460209
C  4.417722 0.049542 0.832244
C  2.622898 2.154614 1.071484
C  4.80816 1.237987 1.435141
C  3.919374 2.290523 1.558299
C  0.647418 3.357833 0.519512
C  -0.562506 3.449048 1.188623
C  0.712721 3.475869 -0.86255
C  -1.723804 3.678908 0.462835
C  -0.456295 3.691878 -1.576687
C  -1.675576 3.799474 -0.918945
H  -1.004271 -0.933284 0.41612
H  -0.939892 -3.920329 -0.412872
H  0.500202 -3.016007 2.966486
H  -0.834185 -1.964125 3.424852
H  0.372991 -1.388623 2.290817
H  -2.573792 -4.375749 1.190646
H  -2.7425 -3.442732 2.678544
H  -1.475719 -4.659238 2.531497
H  -3.28375 -2.915701 -0.336765
H  3.395639 -2.164082 -0.031724
H  1.208151 0.872728 0.080703
H  5.11466 -0.773305 0.740448
H  5.815159 1.34358 1.815338
H  4.220861 3.214443 2.034963
H  -0.594191 3.351624 2.266275
H  1.663489 3.407372 -1.376668
H  -2.668833 3.759003 0.983585
H  -0.410213 3.785598 -2.653591
H  -2.582411 3.977319 -1.481368
elementType: Cl O N C H
totalener: -2050.67172692 hartree
nucrepener: 2882.65090188 hartree
electener: -4933.32262880 hartree
oneelecener: -8540.48207405 hartree
twoeener: 3607.15944526 hartree
cpcmener: -0.03977292 hartree
kineticenergy: 2044.45658823 hartree
xcener: -151.864746946855 hartree
chargesum: -0.0000000
charge: -0.056724 -0.065048 -0.276015 -0.464564 -0.334801 -0.100971 0.088620 0.062899 -0.095574 -0.260857 -0.272959 -0.224484 0.436108 0.053335 0.390729 0.011236 -0.220501 -0.207407 -0.217497 0.286469 -0.113377 -0.242012 0.280122 -0.222008 -0.193747 -0.150051 -0.115778 -0.212600 0.082262 0.098532 0.103287 0.097559 0.088981 0.094281 0.102039 0.099756 0.130799 0.139341 0.134978 0.147939 0.161737 0.150411 0.150268 0.159181 0.164255 0.163641 0.168210
qa: -0.0567 -0.0650 -0.2760 -0.4646 -0.3348 -0.1010 0.0886 0.0629 -0.0956 -0.2609 -0.2730 -0.2245 0.4361 0.0533 0.3907 0.0112 -0.2205 -0.2074 -0.2175 0.2865 -0.1134 -0.2420 0.2801 -0.2220 -0.1937 -0.1501 -0.1158 -0.2126 0.0823 0.0985 0.1033 0.0976 0.0890 0.0943 0.1020 0.0998 0.1308 0.1393 0.1350 0.1479 0.1617 0.1504 0.1503 0.1592 0.1643 0.1636 0.1682
va: 1.2879 1.2414 2.1580 2.0396 2.0765 3.1096 3.7325 3.8553 3.8819 3.9159 3.9142 3.9056 4.1483 4.2125 3.7550 3.7457 4.0175 3.9101 3.9722 3.7324 3.8998 3.9945 3.6673 3.9823 3.9373 3.8052 3.8490 3.8086 1.0097 1.0288 1.0004 1.0004 1.0064 1.0056 0.9999 1.0004 1.0197 1.0199 1.0280 1.0020 0.9881 1.0056 1.0037 0.9961 0.9903 0.9870 0.9900
dispcorr: -0.026505940 hartree
energy: -2050.698232855541
dipole: 13.79279 -14.16298 -0.37019 -5.29947 5.11485 -0.18463 18.73081 -15.94808 2.78273
magnitude: 2.81331 au
magnitude: 7.15087 debye
